ESJ 291


ESJ291 is registered to a Grey 1959, Morris with a Petrol engine. It Failed its most recent MOT Test on the 03 May 2012

3 unique faults (5 Total) reported in its MOT History (4 Tests).

2 common/recurring faults, the most frequent (2 times) is: Offside Front Service brake grabbing slightly (3.7.C.2).

75% (3) MOT Pass Rate and a 25% (1) MOT Failure Rate.

22,654 recorded miles.

ESJ 291


ESJ291 is registered to a Grey 1959, Morris with a Petrol engine. It Failed its most recent MOT Test on the 03 May 2012

3 unique faults (5 Total) reported in its MOT History (4 Tests).

2 common/recurring faults, the most frequent (2 times) is: Offside Front Service brake grabbing slightly (3.7.C.2).

75% (3) MOT Pass Rate and a 25% (1) MOT Failure Rate.

22,654 recorded miles.

MOT PASS/Failure rate for ESJ 291

all MOT test results for ESJ 291 represented as a percentage
MOT PASS/Failure rate for ESJ 291
all MOT test results for ESJ 291 represented as a percentage

PERCENTAGE OF VEHICLE FAULTS WITH ESJ 291

ALL REPORTED FAULTS, DISPLAYED BY PERCENTAGE OF OCCURRENCE DURING ALL MOT TESTS
PERCENTAGE OF VEHICLE FAULTS WITH ESJ 291
ALL REPORTED FAULTS, DISPLAYED BY PERCENTAGE OF OCCURRENCE DURING ALL MOT TESTS
ADVISORY

USER ENTERED

PASS WITH RECTIFICATION

ESJ 291 annual Faults by type

ALL REPORTED FAULTS, DISPLAYED over time and categorised by type
ESJ 291 annual Faults by type
ALL REPORTED FAULTS, DISPLAYED over time and categorised by type

RECURRING FAULTS WITH ESJ 291

FAULTS THAT HAVE OCCURED MORE THAN ONCE DURING ESJ 291's MOT HISTORY
RECURRING FAULTS WITH ESJ 291
FAULTS THAT HAVE OCCURED MORE THAN ONCE DURING ESJ 291's MOT HISTORY
Fault Fault Test Date Test Date/Time Reference MOT Test Reference
2 Offside front service brake grabbing slightly (3.7.c.2) Offside front service brake grabbing slightly (3.7.c.2) 03 May 2012 [09:45] 03/05/2012 03 May 2012 [09:45] 03/05/2012 957274422194 957274422194 625834622167 625834622167
2 Vehicle undersealed not allowing full inspection Vehicle undersealed not allowing full inspection 03 May 2012 [09:45] 03/05/2012 03 May 2012 [09:45] 03/05/2012 957274422194 957274422194 625834622167 625834622167

ALL ESJ 291 ADVISORIES [2]

ALL ADVISORIES, ORDERED by OCCURRENCE DURING ESJ 291's MOT HISTORY
ALL ESJ 291 ADVISORIES [2]
ALL ADVISORIES, ORDERED by OCCURRENCE DURING ESJ 291's MOT HISTORY
Advisory Faults | source www.vehiclestats.co.uk
Fault Fault Test Date Test Date/Time Reference MOT Test Reference
2 Offside front service brake grabbing slightly (3.7.c.2) Offside front service brake grabbing slightly (3.7.c.2) 03 May 2012 [09:45] 03/05/2012 03 May 2012 [09:45] 03/05/2012 957274422194 957274422194 625834622167 625834622167

ALL ESJ 291 User Entered Faults [2]

ALL User Entered faults, ORDERED by OCCURRENCE DURING ESJ 291's MOT HISTORY
ALL ESJ 291 User Entered Faults [2]
ALL User Entered faults, ORDERED by OCCURRENCE DURING ESJ 291's MOT HISTORY
Advisory Faults | source www.vehiclestats.co.uk
Fault Fault Test Date Test Date/Time Reference MOT Test Reference
2 Vehicle undersealed not allowing full inspection Vehicle undersealed not allowing full inspection 03 May 2012 [09:45] 03/05/2012 03 May 2012 [09:45] 03/05/2012 957274422194 957274422194 625834622167 625834622167

ALL ESJ 291 Pass With Rectification Faults [1]

ALL Pass With Rectification faults, ORDERED by OCCURRENCE DURING ESJ 291's MOT HISTORY
ALL ESJ 291 Pass With Rectification Faults [1]
ALL Pass With Rectification faults, ORDERED by OCCURRENCE DURING ESJ 291's MOT HISTORY
Pass With Rectification Faults | source www.vehiclestats.co.uk
Fault Fault Test Date Test Date/Time Reference MOT Test Reference
1 Offside rear stop lamp not working (1.2.1b) Offside rear stop lamp not working (1.2.1b) 03 May 2012 [09:45] 03/05/2012 625834622167 625834622167

MOT TEST: 03 May 2012 09:45:41 PASSED
MOT TEST: 03 May 2012 09:45:41 PASSED

This test (957274422194) was completed on the 03 May 2012 09:45:41 and PASSED the requirements for a valid MOT with 2 comments.

This test (957274422194) was completed on the 03 May 2012 09:45:41 and PASSED the requirements for a valid MOT with 2 comments.

Recorded mileage: 22,654

Recorded mileage: 22,654


ADVISORY

USER ENTERED


MOT TEST: 03 May 2012 09:45:41 FAILED
MOT TEST: 03 May 2012 09:45:41 FAILED

This test (625834622167) was completed on the 03 May 2012 09:45:41 and FAILED the requirements for a valid MOT with 3 comments.

This test (625834622167) was completed on the 03 May 2012 09:45:41 and FAILED the requirements for a valid MOT with 3 comments.

Recorded mileage: 22,654

Recorded mileage: 22,654


ADVISORY

USER ENTERED

PASS WITH RECTIFICATION


MOT TEST: 22 March 2007 12:50:56 PASSED
MOT TEST: 22 March 2007 12:50:56 PASSED

This test (181631887098) was completed on the 22 March 2007 12:50:56 and PASSED the requirements for a valid MOT with 0 comments.

This test (181631887098) was completed on the 22 March 2007 12:50:56 and PASSED the requirements for a valid MOT with 0 comments.

Recorded mileage: 22,498

Recorded mileage: 22,498


MOT TEST: 29 March 2006 09:30:55 PASSED
MOT TEST: 29 March 2006 09:30:55 PASSED

This test (103428786014) was completed on the 29 March 2006 09:30:55 and PASSED the requirements for a valid MOT with 0 comments.

This test (103428786014) was completed on the 29 March 2006 09:30:55 and PASSED the requirements for a valid MOT with 0 comments.

Recorded mileage: 22,205

Recorded mileage: 22,205