ESJ 626


ESJ626 is registered to a White 1963, Morris Minor 1000 with a Petrol engine. It Failed its most recent MOT Test on the 06 July 2017

23 unique faults (26 Total) reported in its MOT History (15 Tests).

3 common/recurring faults, the most frequent (2 times) is: Left and right hand front suspension arms bushes perished and splitting early attension adviced.

60% (9) MOT Pass Rate and a 40% (6) MOT Failure Rate.

58,509 recorded miles.

ESJ 626


ESJ626 is registered to a White 1963, Morris Minor 1000 with a Petrol engine. It Failed its most recent MOT Test on the 06 July 2017

23 unique faults (26 Total) reported in its MOT History (15 Tests).

3 common/recurring faults, the most frequent (2 times) is: Left and right hand front suspension arms bushes perished and splitting early attension adviced.

60% (9) MOT Pass Rate and a 40% (6) MOT Failure Rate.

58,509 recorded miles.

MOT PASS/Failure rate for ESJ 626

all MOT test results for ESJ 626 represented as a percentage
MOT PASS/Failure rate for ESJ 626
all MOT test results for ESJ 626 represented as a percentage

PERCENTAGE OF VEHICLE FAULTS WITH ESJ 626

ALL REPORTED FAULTS, DISPLAYED BY PERCENTAGE OF OCCURRENCE DURING ALL MOT TESTS
PERCENTAGE OF VEHICLE FAULTS WITH ESJ 626
ALL REPORTED FAULTS, DISPLAYED BY PERCENTAGE OF OCCURRENCE DURING ALL MOT TESTS
ADVISORY

FAIL

USER ENTERED

PASS WITH RECTIFICATION

ESJ 626 annual Faults by type

ALL REPORTED FAULTS, DISPLAYED over time and categorised by type
ESJ 626 annual Faults by type
ALL REPORTED FAULTS, DISPLAYED over time and categorised by type

RECURRING FAULTS WITH ESJ 626

FAULTS THAT HAVE OCCURED MORE THAN ONCE DURING ESJ 626's MOT HISTORY
RECURRING FAULTS WITH ESJ 626
FAULTS THAT HAVE OCCURED MORE THAN ONCE DURING ESJ 626's MOT HISTORY
Fault Fault Test Date Test Date/Time Reference MOT Test Reference
2 Left and right hand front suspension arms bushes perished and splitting early attension adviced Left and right hand front suspension arms bushes perished and splitting early attension adviced 15 May 2015 [13:12] 15/05/2015 14 May 2015 [09:52] 14/05/2015 347625535112 347625535112 697684935113 697684935113
2 Parking brake: efficiency below requirements (3.7.b.7) Parking brake: efficiency below requirements (3.7.b.7) 14 May 2015 [09:52] 14/05/2015 06 September 2006 [09:38] 06/09/2006 697684935113 697684935113 341489746222 341489746222
2 Offside front suspension component mounting prescribed area is excessively corroded (2.4.a.3) Offside front suspension component mounting prescribed area is excessively corroded (2.4.a.3) 07 September 2011 [16:14] 07/09/2011 06 September 2006 [09:38] 06/09/2006 635740651270 635740651270 341489746222 341489746222

ALL ESJ 626 ADVISORIES [3]

ALL ADVISORIES, ORDERED by OCCURRENCE DURING ESJ 626's MOT HISTORY
ALL ESJ 626 ADVISORIES [3]
ALL ADVISORIES, ORDERED by OCCURRENCE DURING ESJ 626's MOT HISTORY
Advisory Faults | source www.vehiclestats.co.uk
Fault Fault Test Date Test Date/Time Reference MOT Test Reference
1 Verry slight play in left hand track rod end Verry slight play in left hand track rod end 06 July 2017 [08:47] 06/07/2017 706201081834 706201081834
1 Both suspension arms bushes well perished Both suspension arms bushes well perished 11 June 2016 [09:58] 11/06/2016 460063739668 460063739668
1 Nearside suspension arm has slight play in a ball joint (2.4.g.2) Nearside suspension arm has slight play in a ball joint (2.4.g.2) 14 May 2015 [09:52] 14/05/2015 697684935113 697684935113

ALL ESJ 626 Failure Faults [18]

ALL Failure faults, ORDERED by OCCURRENCE DURING ESJ 626's MOT HISTORY
ALL ESJ 626 Failure Faults [18]
ALL Failure faults, ORDERED by OCCURRENCE DURING ESJ 626's MOT HISTORY
Fail Faults | source www.vehiclestats.co.uk
Fault Fault Test Date Test Date/Time Reference MOT Test Reference
2 Parking brake: efficiency below requirements (3.7.b.7) Parking brake: efficiency below requirements (3.7.b.7) 14 May 2015 [09:52] 14/05/2015 06 September 2006 [09:38] 06/09/2006 697684935113 697684935113 341489746222 341489746222
2 Offside front suspension component mounting prescribed area is excessively corroded (2.4.a.3) Offside front suspension component mounting prescribed area is excessively corroded (2.4.a.3) 07 September 2011 [16:14] 07/09/2011 06 September 2006 [09:38] 06/09/2006 635740651270 635740651270 341489746222 341489746222
1 Rear brakes imbalanced across an axle axle 2 (3.7.b.5b) Rear brakes imbalanced across an axle axle 2 (3.7.b.5b) 11 June 2016 [09:58] 11/06/2016 460063739668 460063739668
1 Nearside front front suspension has excessive play in a lower suspension ball joint (2.5.b.1a) Nearside front front suspension has excessive play in a lower suspension ball joint (2.5.b.1a) 11 June 2016 [09:58] 11/06/2016 460063739668 460063739668
1 Offside front shock absorber has a serious fluid leak (2.7.3) Offside front shock absorber has a serious fluid leak (2.7.3) 11 June 2016 [09:58] 11/06/2016 460063739668 460063739668
1 Offside front suspension arm rubber bush deteriorated resulting in excessive movement (2.4.g.2) Offside front suspension arm rubber bush deteriorated resulting in excessive movement (2.4.g.2) 11 June 2016 [09:58] 11/06/2016 460063739668 460063739668
1 Nearside track rod end ball pin shank loose (2.2.b.1c) Nearside track rod end ball pin shank loose (2.2.b.1c) 11 June 2016 [09:58] 11/06/2016 460063739668 460063739668
1 Rear brake application uneven (3.7.b.2) Rear brake application uneven (3.7.b.2) 14 May 2015 [09:52] 14/05/2015 697684935113 697684935113
1 Offside rear rear brake binding (3.7.b.1) Offside rear rear brake binding (3.7.b.1) 14 May 2015 [09:52] 14/05/2015 697684935113 697684935113
1 Brakes imbalanced across an axle (3.7.b.5b) Brakes imbalanced across an axle (3.7.b.5b) 14 May 2015 [09:52] 14/05/2015 697684935113 697684935113
1 Offside rear suspension spring mounting prescribed area is excessively corroded (2.4.a.3) Offside rear suspension spring mounting prescribed area is excessively corroded (2.4.a.3) 06 July 2009 [15:17] 06/07/2009 521957489134 521957489134
1 Windscreen washer provides insufficient washer liquid (8.2.3) Windscreen washer provides insufficient washer liquid (8.2.3) 06 July 2009 [15:17] 06/07/2009 521957489134 521957489134
1 Nearside steering rack gaiter split (2.2.d.2d) Nearside steering rack gaiter split (2.2.d.2d) 06 September 2006 [09:38] 06/09/2006 341489746222 341489746222
1 Rear brake hose bulging under pressure (3.6.b.3) Rear brake hose bulging under pressure (3.6.b.3) 06 September 2006 [09:38] 06/09/2006 341489746222 341489746222
1 Rear stop lamp not working (1.2.1b) Rear stop lamp not working (1.2.1b) 06 September 2006 [09:38] 06/09/2006 341489746222 341489746222
1 Service brake: efficiency below requirements (3.7.b.7) Service brake: efficiency below requirements (3.7.b.7) 06 September 2006 [09:38] 06/09/2006 341489746222 341489746222

ALL ESJ 626 User Entered Faults [4]

ALL User Entered faults, ORDERED by OCCURRENCE DURING ESJ 626's MOT HISTORY
ALL ESJ 626 User Entered Faults [4]
ALL User Entered faults, ORDERED by OCCURRENCE DURING ESJ 626's MOT HISTORY
User Entered Faults | source www.vehiclestats.co.uk
Fault Fault Test Date Test Date/Time Reference MOT Test Reference
2 Left and right hand front suspension arms bushes perished and splitting early attension adviced Left and right hand front suspension arms bushes perished and splitting early attension adviced 15 May 2015 [13:12] 15/05/2015 14 May 2015 [09:52] 14/05/2015 347625535112 347625535112 697684935113 697684935113
1 Slight lift on left hand front lower trunion Slight lift on left hand front lower trunion 15 May 2015 [13:12] 15/05/2015 347625535112 347625535112
1 Rear window obstructing veiw Rear window obstructing veiw 07 September 2011 [16:14] 07/09/2011 635740651270 635740651270

ALL ESJ 626 Pass With Rectification Faults [1]

ALL Pass With Rectification faults, ORDERED by OCCURRENCE DURING ESJ 626's MOT HISTORY
ALL ESJ 626 Pass With Rectification Faults [1]
ALL Pass With Rectification faults, ORDERED by OCCURRENCE DURING ESJ 626's MOT HISTORY
Pass With Rectification Faults | source www.vehiclestats.co.uk
Fault Fault Test Date Test Date/Time Reference MOT Test Reference
1 Horn not working (1.6.2a) Horn not working (1.6.2a) 12 October 2012 [16:01] 12/10/2012 306696182296 306696182296

MOT TEST: 06 July 2017 08:47:56 PASSED
MOT TEST: 06 July 2017 08:47:56 PASSED

This test (706201081834) was completed on the 06 July 2017 08:47:56 and PASSED the requirements for a valid MOT with 1 comments.

This test (706201081834) was completed on the 06 July 2017 08:47:56 and PASSED the requirements for a valid MOT with 1 comments.

Recorded mileage: 58,509

Recorded mileage: 58,509


ADVISORY


MOT TEST: 01 July 2016 17:03:40 PASSED
MOT TEST: 01 July 2016 17:03:40 PASSED

This test (145740962196) was completed on the 01 July 2016 17:03:40 and PASSED the requirements for a valid MOT with 0 comments.

This test (145740962196) was completed on the 01 July 2016 17:03:40 and PASSED the requirements for a valid MOT with 0 comments.

Recorded mileage: 58,141

Recorded mileage: 58,141


MOT TEST: 11 June 2016 09:58:39 FAILED
MOT TEST: 11 June 2016 09:58:39 FAILED

This test (460063739668) was completed on the 11 June 2016 09:58:39 and FAILED the requirements for a valid MOT with 6 comments.

This test (460063739668) was completed on the 11 June 2016 09:58:39 and FAILED the requirements for a valid MOT with 6 comments.

Recorded mileage: 58,139

Recorded mileage: 58,139


ADVISORY

FAIL


MOT TEST: 15 May 2015 13:12:33 PASSED
MOT TEST: 15 May 2015 13:12:33 PASSED

This test (347625535112) was completed on the 15 May 2015 13:12:33 and PASSED the requirements for a valid MOT with 2 comments.

This test (347625535112) was completed on the 15 May 2015 13:12:33 and PASSED the requirements for a valid MOT with 2 comments.

Recorded mileage: 55,903

Recorded mileage: 55,903


USER ENTERED


MOT TEST: 14 May 2015 09:52:12 FAILED
MOT TEST: 14 May 2015 09:52:12 FAILED

This test (697684935113) was completed on the 14 May 2015 09:52:12 and FAILED the requirements for a valid MOT with 6 comments.

This test (697684935113) was completed on the 14 May 2015 09:52:12 and FAILED the requirements for a valid MOT with 6 comments.

Recorded mileage: 55,903

Recorded mileage: 55,903


ADVISORY

FAIL

USER ENTERED


MOT TEST: 12 October 2012 16:01:23 PASSED
MOT TEST: 12 October 2012 16:01:23 PASSED

This test (646746082223) was completed on the 12 October 2012 16:01:23 and PASSED the requirements for a valid MOT with 0 comments.

This test (646746082223) was completed on the 12 October 2012 16:01:23 and PASSED the requirements for a valid MOT with 0 comments.

Recorded mileage: 55,897

Recorded mileage: 55,897


MOT TEST: 12 October 2012 16:01:23 FAILED
MOT TEST: 12 October 2012 16:01:23 FAILED

This test (306696182296) was completed on the 12 October 2012 16:01:23 and FAILED the requirements for a valid MOT with 1 comments.

This test (306696182296) was completed on the 12 October 2012 16:01:23 and FAILED the requirements for a valid MOT with 1 comments.

Recorded mileage: 55,897

Recorded mileage: 55,897


PASS WITH RECTIFICATION


MOT TEST: 11 October 2011 16:42:08 PASSED
MOT TEST: 11 October 2011 16:42:08 PASSED

This test (627584981226) was completed on the 11 October 2011 16:42:08 and PASSED the requirements for a valid MOT with 0 comments.

This test (627584981226) was completed on the 11 October 2011 16:42:08 and PASSED the requirements for a valid MOT with 0 comments.

Recorded mileage: 55,887

Recorded mileage: 55,887


MOT TEST: 07 September 2011 16:14:02 FAILED
MOT TEST: 07 September 2011 16:14:02 FAILED

This test (635740651270) was completed on the 07 September 2011 16:14:02 and FAILED the requirements for a valid MOT with 2 comments.

This test (635740651270) was completed on the 07 September 2011 16:14:02 and FAILED the requirements for a valid MOT with 2 comments.

Recorded mileage: 55,883

Recorded mileage: 55,883


FAIL

USER ENTERED


MOT TEST: 14 July 2010 18:02:14 PASSED
MOT TEST: 14 July 2010 18:02:14 PASSED

This test (830045890186) was completed on the 14 July 2010 18:02:14 and PASSED the requirements for a valid MOT with 0 comments.

This test (830045890186) was completed on the 14 July 2010 18:02:14 and PASSED the requirements for a valid MOT with 0 comments.

Recorded mileage: 55,579

Recorded mileage: 55,579


MOT TEST: 14 July 2009 16:13:39 PASSED
MOT TEST: 14 July 2009 16:13:39 PASSED

This test (443645599142) was completed on the 14 July 2009 16:13:39 and PASSED the requirements for a valid MOT with 0 comments.

This test (443645599142) was completed on the 14 July 2009 16:13:39 and PASSED the requirements for a valid MOT with 0 comments.

Recorded mileage: 55,241

Recorded mileage: 55,241


MOT TEST: 06 July 2009 15:17:54 FAILED
MOT TEST: 06 July 2009 15:17:54 FAILED

This test (521957489134) was completed on the 06 July 2009 15:17:54 and FAILED the requirements for a valid MOT with 2 comments.

This test (521957489134) was completed on the 06 July 2009 15:17:54 and FAILED the requirements for a valid MOT with 2 comments.

Recorded mileage: 55,237

Recorded mileage: 55,237


FAIL


MOT TEST: 18 April 2008 10:57:57 PASSED
MOT TEST: 18 April 2008 10:57:57 PASSED

This test (920919608169) was completed on the 18 April 2008 10:57:57 and PASSED the requirements for a valid MOT with 0 comments.

This test (920919608169) was completed on the 18 April 2008 10:57:57 and PASSED the requirements for a valid MOT with 0 comments.

Recorded mileage: 55,050

Recorded mileage: 55,050


MOT TEST: 07 September 2006 12:08:20 PASSED
MOT TEST: 07 September 2006 12:08:20 PASSED

This test (451480556219) was completed on the 07 September 2006 12:08:20 and PASSED the requirements for a valid MOT with 0 comments.

This test (451480556219) was completed on the 07 September 2006 12:08:20 and PASSED the requirements for a valid MOT with 0 comments.

Recorded mileage: 54,774

Recorded mileage: 54,774


MOT TEST: 06 September 2006 09:38:25 FAILED
MOT TEST: 06 September 2006 09:38:25 FAILED

This test (341489746222) was completed on the 06 September 2006 09:38:25 and FAILED the requirements for a valid MOT with 6 comments.

This test (341489746222) was completed on the 06 September 2006 09:38:25 and FAILED the requirements for a valid MOT with 6 comments.

Recorded mileage: 54,770

Recorded mileage: 54,770


FAIL