ESJ 638


ESJ638 is registered to a Black 1938, Morris 8 with a Petrol engine. It Failed its most recent MOT Test on the 25 October 2007

10 unique faults (11 Total) reported in its MOT History (4 Tests).

1 common/recurring faults.

50% (2) MOT Pass Rate and a 50% (2) MOT Failure Rate.

23,223 recorded miles.

ESJ 638


ESJ638 is registered to a Black 1938, Morris 8 with a Petrol engine. It Failed its most recent MOT Test on the 25 October 2007

10 unique faults (11 Total) reported in its MOT History (4 Tests).

1 common/recurring faults.

50% (2) MOT Pass Rate and a 50% (2) MOT Failure Rate.

23,223 recorded miles.

MOT PASS/Failure rate for ESJ 638

all MOT test results for ESJ 638 represented as a percentage
MOT PASS/Failure rate for ESJ 638
all MOT test results for ESJ 638 represented as a percentage

PERCENTAGE OF VEHICLE FAULTS WITH ESJ 638

ALL REPORTED FAULTS, DISPLAYED BY PERCENTAGE OF OCCURRENCE DURING ALL MOT TESTS
PERCENTAGE OF VEHICLE FAULTS WITH ESJ 638
ALL REPORTED FAULTS, DISPLAYED BY PERCENTAGE OF OCCURRENCE DURING ALL MOT TESTS
ADVISORY

FAIL

ESJ 638 annual Faults by type

ALL REPORTED FAULTS, DISPLAYED over time and categorised by type
ESJ 638 annual Faults by type
ALL REPORTED FAULTS, DISPLAYED over time and categorised by type

ALL ESJ 638 ADVISORIES [2]

ALL ADVISORIES, ORDERED by OCCURRENCE DURING ESJ 638's MOT HISTORY
ALL ESJ 638 ADVISORIES [2]
ALL ADVISORIES, ORDERED by OCCURRENCE DURING ESJ 638's MOT HISTORY
Advisory Faults | source www.vehiclestats.co.uk
Fault Fault Test Date Test Date/Time Reference MOT Test Reference
1 Nearside front axle king pin has slight play in pin and/or bush (2.5.a.3a) Nearside front axle king pin has slight play in pin and/or bush (2.5.a.3a) 28 September 2005 [10:31] 28/09/2005 672981875212 672981875212
1 Offside front axle king pin has slight play in pin and/or bush (2.5.a.3a) Offside front axle king pin has slight play in pin and/or bush (2.5.a.3a) 28 September 2005 [10:31] 28/09/2005 672981875212 672981875212

ALL ESJ 638 Failure Faults [9]

ALL Failure faults, ORDERED by OCCURRENCE DURING ESJ 638's MOT HISTORY
ALL ESJ 638 Failure Faults [9]
ALL Failure faults, ORDERED by OCCURRENCE DURING ESJ 638's MOT HISTORY
Fail Faults | source www.vehiclestats.co.uk
Fault Fault Test Date Test Date/Time Reference MOT Test Reference
2 Parking brake: efficiency below requirements (3.7.b.7) Parking brake: efficiency below requirements (3.7.b.7) 22 October 2007 [14:56] 22/10/2007 15 August 2007 [13:07] 15/08/2007 264945497202 264945497202 561177627237 561177627237
1 Nearside rear parking brake recording little or no effort (3.7.b.6a) Nearside rear parking brake recording little or no effort (3.7.b.6a) 22 October 2007 [14:56] 22/10/2007 264945497202 264945497202
1 Offside inner rear tyre has a tear, caused by separation or partial failure of its structure (4.1.d.1b) Offside inner rear tyre has a tear, caused by separation or partial failure of its structure (4.1.d.1b) 15 August 2007 [13:07] 15/08/2007 561177627237 561177627237
1 Nearside rear stop lamp adversely affected by the operation of another lamp (1.2.1f) Nearside rear stop lamp adversely affected by the operation of another lamp (1.2.1f) 15 August 2007 [13:07] 15/08/2007 561177627237 561177627237
1 Offside rear stop lamp adversely affected by the operation of another lamp (1.2.1f) Offside rear stop lamp adversely affected by the operation of another lamp (1.2.1f) 15 August 2007 [13:07] 15/08/2007 561177627237 561177627237
1 Offside semaphore indicator arm arm does not show an amber light to the rear (1.4.c.1b) Offside semaphore indicator arm arm does not show an amber light to the rear (1.4.c.1b) 15 August 2007 [13:07] 15/08/2007 561177627237 561177627237
1 Nearside rear brake binding (3.7.b.1) Nearside rear brake binding (3.7.b.1) 15 August 2007 [13:07] 15/08/2007 561177627237 561177627237
1 Front brake application uneven (3.7.b.2) Front brake application uneven (3.7.b.2) 15 August 2007 [13:07] 15/08/2007 561177627237 561177627237

MOT TEST: 25 October 2007 16:55:08 PASSED
MOT TEST: 25 October 2007 16:55:08 PASSED

This test (403308297215) was completed on the 25 October 2007 16:55:08 and PASSED the requirements for a valid MOT with 0 comments.

This test (403308297215) was completed on the 25 October 2007 16:55:08 and PASSED the requirements for a valid MOT with 0 comments.

Recorded mileage: 23,223

Recorded mileage: 23,223


MOT TEST: 22 October 2007 14:56:15 FAILED
MOT TEST: 22 October 2007 14:56:15 FAILED

This test (264945497202) was completed on the 22 October 2007 14:56:15 and FAILED the requirements for a valid MOT with 2 comments.

This test (264945497202) was completed on the 22 October 2007 14:56:15 and FAILED the requirements for a valid MOT with 2 comments.

Recorded mileage: 23,223

Recorded mileage: 23,223


FAIL


MOT TEST: 15 August 2007 13:07:05 FAILED
MOT TEST: 15 August 2007 13:07:05 FAILED

This test (561177627237) was completed on the 15 August 2007 13:07:05 and FAILED the requirements for a valid MOT with 7 comments.

This test (561177627237) was completed on the 15 August 2007 13:07:05 and FAILED the requirements for a valid MOT with 7 comments.

Recorded mileage: 23,223

Recorded mileage: 23,223


FAIL


MOT TEST: 28 September 2005 10:31:24 PASSED
MOT TEST: 28 September 2005 10:31:24 PASSED

This test (672981875212) was completed on the 28 September 2005 10:31:24 and PASSED the requirements for a valid MOT with 2 comments.

This test (672981875212) was completed on the 28 September 2005 10:31:24 and PASSED the requirements for a valid MOT with 2 comments.

Recorded mileage: 22,755

Recorded mileage: 22,755


ADVISORY