ESJ 765


ESJ765 is registered to a Green 1971, Morris Minor 1000 with a Petrol engine. It Failed its most recent MOT Test on the 17 November 2017

50 unique faults (65 Total) reported in its MOT History (13 Tests).

6 common/recurring faults, the most frequent (3 times) is: Oil leak.

46% (6) MOT Pass Rate and a 54% (7) MOT Failure Rate.

51,278 recorded miles.

ESJ 765


ESJ765 is registered to a Green 1971, Morris Minor 1000 with a Petrol engine. It Failed its most recent MOT Test on the 17 November 2017

50 unique faults (65 Total) reported in its MOT History (13 Tests).

6 common/recurring faults, the most frequent (3 times) is: Oil leak.

46% (6) MOT Pass Rate and a 54% (7) MOT Failure Rate.

51,278 recorded miles.

MOT PASS/Failure rate for ESJ 765

all MOT test results for ESJ 765 represented as a percentage
MOT PASS/Failure rate for ESJ 765
all MOT test results for ESJ 765 represented as a percentage

PERCENTAGE OF VEHICLE FAULTS WITH ESJ 765

ALL REPORTED FAULTS, DISPLAYED BY PERCENTAGE OF OCCURRENCE DURING ALL MOT TESTS
PERCENTAGE OF VEHICLE FAULTS WITH ESJ 765
ALL REPORTED FAULTS, DISPLAYED BY PERCENTAGE OF OCCURRENCE DURING ALL MOT TESTS
ADVISORY

FAIL

USER ENTERED

ESJ 765 annual Faults by type

ALL REPORTED FAULTS, DISPLAYED over time and categorised by type
ESJ 765 annual Faults by type
ALL REPORTED FAULTS, DISPLAYED over time and categorised by type

RECURRING FAULTS WITH ESJ 765

FAULTS THAT HAVE OCCURED MORE THAN ONCE DURING ESJ 765's MOT HISTORY
RECURRING FAULTS WITH ESJ 765
FAULTS THAT HAVE OCCURED MORE THAN ONCE DURING ESJ 765's MOT HISTORY
Fault Fault Test Date Test Date/Time Reference MOT Test Reference
3 Oil leak Oil leak 23 November 2015 [13:42] 23/11/2015 17 November 2015 [11:49] 17/11/2015 18 September 2014 [15:49] 18/09/2014 363198249304 363198249304 927723414977 927723414977 449951164230 449951164230
2 Nearside front steering rack gaitor leaking fluid Nearside front steering rack gaitor leaking fluid 23 November 2015 [13:42] 23/11/2015 17 November 2015 [11:49] 17/11/2015 363198249304 363198249304 927723414977 927723414977
2 Nearside rear brake recording little or no effort (3.7.b.5a) Nearside rear brake recording little or no effort (3.7.b.5a) 17 November 2015 [11:49] 17/11/2015 10 November 2014 [15:20] 10/11/2014 927723414977 927723414977 525574214308 525574214308
2 Horn not working (1.6.2a) Horn not working (1.6.2a) 10 November 2014 [15:20] 10/11/2014 18 September 2014 [15:49] 18/09/2014 525574214308 525574214308 449951164230 449951164230
2 Brakes imbalanced across an axle (3.7.b.5b) Brakes imbalanced across an axle (3.7.b.5b) 10 November 2014 [15:20] 10/11/2014 18 September 2014 [15:49] 18/09/2014 525574214308 525574214308 449951164230 449951164230
2 Rear vehicle structure has excessive corrosion, seriously affecting its strength within 30cm of the body mountings (6.1.b.2) Rear vehicle structure has excessive corrosion, seriously affecting its strength within 30cm of the body mountings (6.1.b.2) 18 September 2014 [15:49] 18/09/2014 18 December 2009 [12:59] 18/12/2009 449951164230 449951164230 824652759370 824652759370

ALL ESJ 765 ADVISORIES [7]

ALL ADVISORIES, ORDERED by OCCURRENCE DURING ESJ 765's MOT HISTORY
ALL ESJ 765 ADVISORIES [7]
ALL ADVISORIES, ORDERED by OCCURRENCE DURING ESJ 765's MOT HISTORY
Advisory Faults | source www.vehiclestats.co.uk
Fault Fault Test Date Test Date/Time Reference MOT Test Reference
2 Oil leak Oil leak 23 November 2015 [13:42] 23/11/2015 17 November 2015 [11:49] 17/11/2015 363198249304 363198249304 927723414977 927723414977
2 Nearside front steering rack gaitor leaking fluid Nearside front steering rack gaitor leaking fluid 23 November 2015 [13:42] 23/11/2015 17 November 2015 [11:49] 17/11/2015 363198249304 363198249304 927723414977 927723414977
1 Nearside front suspension has slight play in a lower suspension ball joint (2.5.b.1a) Nearside front suspension has slight play in a lower suspension ball joint (2.5.b.1a) 18 September 2014 [15:49] 18/09/2014 449951164230 449951164230
1 Brakes imbalanced requirements only just met. It would appear that the braking system requires adjustment or repair. (3.7.b.5b) Brakes imbalanced requirements only just met. It would appear that the braking system requires adjustment or repair. (3.7.b.5b) 27 March 2012 [14:55] 27/03/2012 798237282059 798237282059
1 Offside rear tyre worn close to the legal limit (4.1.e.1) Offside rear tyre worn close to the legal limit (4.1.e.1) 18 December 2009 [12:59] 18/12/2009 824652759370 824652759370

ALL ESJ 765 Failure Faults [57]

ALL Failure faults, ORDERED by OCCURRENCE DURING ESJ 765's MOT HISTORY
ALL ESJ 765 Failure Faults [57]
ALL Failure faults, ORDERED by OCCURRENCE DURING ESJ 765's MOT HISTORY
Fail Faults | source www.vehiclestats.co.uk
Fault Fault Test Date Test Date/Time Reference MOT Test Reference
2 Nearside rear brake recording little or no effort (3.7.b.5a) Nearside rear brake recording little or no effort (3.7.b.5a) 17 November 2015 [11:49] 17/11/2015 10 November 2014 [15:20] 10/11/2014 927723414977 927723414977 525574214308 525574214308
2 Horn not working (1.6.2a) Horn not working (1.6.2a) 10 November 2014 [15:20] 10/11/2014 18 September 2014 [15:49] 18/09/2014 525574214308 525574214308 449951164230 449951164230
2 Brakes imbalanced across an axle (3.7.b.5b) Brakes imbalanced across an axle (3.7.b.5b) 10 November 2014 [15:20] 10/11/2014 18 September 2014 [15:49] 18/09/2014 525574214308 525574214308 449951164230 449951164230
2 Rear vehicle structure has excessive corrosion, seriously affecting its strength within 30cm of the body mountings (6.1.b.2) Rear vehicle structure has excessive corrosion, seriously affecting its strength within 30cm of the body mountings (6.1.b.2) 18 September 2014 [15:49] 18/09/2014 18 December 2009 [12:59] 18/12/2009 449951164230 449951164230 824652759370 824652759370
1 Fuel tank leaking (7.2.3) Fuel tank leaking (7.2.3) 09 November 2017 [13:36] 09/11/2017 912809518236 912809518236
1 Nearside front brake binding (3.7.b.1) Nearside front brake binding (3.7.b.1) 09 November 2017 [13:36] 09/11/2017 912809518236 912809518236
1 Offside front brake binding (3.7.b.1) Offside front brake binding (3.7.b.1) 09 November 2017 [13:36] 09/11/2017 912809518236 912809518236
1 Windscreen washer provides insufficient washer liquid (8.2.3) Windscreen washer provides insufficient washer liquid (8.2.3) 09 November 2017 [13:36] 09/11/2017 912809518236 912809518236
1 Rear brake application uneven (3.7.b.2) Rear brake application uneven (3.7.b.2) 09 November 2017 [13:36] 09/11/2017 912809518236 912809518236
1 Rear brakes imbalanced across an axle axle 2 (3.7.b.5b) Rear brakes imbalanced across an axle axle 2 (3.7.b.5b) 17 November 2015 [11:49] 17/11/2015 927723414977 927723414977
1 Nearside rear parking brake recording little or no effort (3.7.b.6a) Nearside rear parking brake recording little or no effort (3.7.b.6a) 10 November 2014 [15:20] 10/11/2014 525574214308 525574214308
1 Offside rear rear position lamp(s) not working (1.1.a.3b) Offside rear rear position lamp(s) not working (1.1.a.3b) 10 November 2014 [15:20] 10/11/2014 525574214308 525574214308
1 Nearside front passenger door cannot be opened from outside the vehicle (6.2.b.1b) Nearside front passenger door cannot be opened from outside the vehicle (6.2.b.1b) 10 November 2014 [15:20] 10/11/2014 525574214308 525574214308
1 Offside front brake actuating linkage mounting prescribed area is excessively corroded (3.3.a.2) Offside front brake actuating linkage mounting prescribed area is excessively corroded (3.3.a.2) 10 November 2014 [15:20] 10/11/2014 525574214308 525574214308
1 Nearside seat belt anchorage prescribed area is inadequately repaired (5.2.6) Nearside seat belt anchorage prescribed area is inadequately repaired (5.2.6) 10 November 2014 [15:20] 10/11/2014 525574214308 525574214308
1 Offside seat belt anchorage prescribed area is inadequately repaired (5.2.6) Offside seat belt anchorage prescribed area is inadequately repaired (5.2.6) 10 November 2014 [15:20] 10/11/2014 525574214308 525574214308
1 Nearside front suspension component mounting prescribed area is excessively corroded (2.4.a.3) Nearside front suspension component mounting prescribed area is excessively corroded (2.4.a.3) 10 November 2014 [15:20] 10/11/2014 525574214308 525574214308
1 Nearside suspension component mounting prescribed area is excessively corroded (2.4.a.3) Nearside suspension component mounting prescribed area is excessively corroded (2.4.a.3) 10 November 2014 [15:20] 10/11/2014 525574214308 525574214308
1 Nearside rear suspension component mounting prescribed area is excessively corroded (2.4.a.3) Nearside rear suspension component mounting prescribed area is excessively corroded (2.4.a.3) 10 November 2014 [15:20] 10/11/2014 525574214308 525574214308
1 Offside rear suspension component mounting prescribed area is excessively corroded (2.4.a.3) Offside rear suspension component mounting prescribed area is excessively corroded (2.4.a.3) 10 November 2014 [15:20] 10/11/2014 525574214308 525574214308
1 Offside front suspension component mounting prescribed area is excessively corroded (2.4.a.3) Offside front suspension component mounting prescribed area is excessively corroded (2.4.a.3) 10 November 2014 [15:20] 10/11/2014 525574214308 525574214308
1 Suspension component mounting prescribed area is excessively corroded (2.4.a.3) Suspension component mounting prescribed area is excessively corroded (2.4.a.3) 10 November 2014 [15:20] 10/11/2014 525574214308 525574214308
1 Vehicle structure has excessive corrosion, seriously affecting its strength within 30cm of the body mountings (6.1.b.2) Vehicle structure has excessive corrosion, seriously affecting its strength within 30cm of the body mountings (6.1.b.2) 18 September 2014 [15:49] 18/09/2014 449951164230 449951164230
1 Front vehicle structure has excessive corrosion, seriously affecting its strength within 30cm of the body mountings (6.1.b.2) Front vehicle structure has excessive corrosion, seriously affecting its strength within 30cm of the body mountings (6.1.b.2) 18 September 2014 [15:49] 18/09/2014 449951164230 449951164230
1 Nearside vehicle structure has excessive corrosion, seriously affecting its strength within 30cm of the body mountings (6.1.b.2) Nearside vehicle structure has excessive corrosion, seriously affecting its strength within 30cm of the body mountings (6.1.b.2) 18 September 2014 [15:49] 18/09/2014 449951164230 449951164230
1 Offside front suspension has excessive play in a lower suspension ball joint (2.5.b.1a) Offside front suspension has excessive play in a lower suspension ball joint (2.5.b.1a) 18 September 2014 [15:49] 18/09/2014 449951164230 449951164230
1 Rear suspension spring mounting prescribed area is deliberately modified which significantly reduces the original strength (2.4.a.3) Rear suspension spring mounting prescribed area is deliberately modified which significantly reduces the original strength (2.4.a.3) 18 September 2014 [15:49] 18/09/2014 449951164230 449951164230
1 Registration plate lamp not working (1.1.c.1d) Registration plate lamp not working (1.1.c.1d) 12 May 2012 [11:51] 12/05/2012 537493632125 537493632125
1 Exhaust has a major leak of exhaust gases (7.1.2) Exhaust has a major leak of exhaust gases (7.1.2) 12 May 2012 [11:51] 12/05/2012 537493632125 537493632125
1 Offside track rod end ball joint dust cover excessively deteriorated so that it no longer prevents the ingress of dirt (2.2.c.1c) Offside track rod end ball joint dust cover excessively deteriorated so that it no longer prevents the ingress of dirt (2.2.c.1c) 12 May 2012 [11:51] 12/05/2012 537493632125 537493632125
1 Offside upper seat belt anchorage prescribed area is excessively corroded (5.2.6) Offside upper seat belt anchorage prescribed area is excessively corroded (5.2.6) 12 May 2012 [11:51] 12/05/2012 537493632125 537493632125
1 Offside suspension component mounting prescribed area is excessively corroded (2.4.a.3) Offside suspension component mounting prescribed area is excessively corroded (2.4.a.3) 12 May 2012 [11:51] 12/05/2012 537493632125 537493632125
1 Offside front track rod end ball joint dust cover excessively deteriorated so that it no longer prevents the ingress of dirt (2.2.c.1c) Offside front track rod end ball joint dust cover excessively deteriorated so that it no longer prevents the ingress of dirt (2.2.c.1c) 27 March 2012 [14:55] 27/03/2012 798237282059 798237282059
1 Centre exhaust has a major leak of exhaust gases (7.1.2) Centre exhaust has a major leak of exhaust gases (7.1.2) 27 March 2012 [14:55] 27/03/2012 798237282059 798237282059
1 Front windscreen washer provides insufficient washer liquid (8.2.3) Front windscreen washer provides insufficient washer liquid (8.2.3) 27 March 2012 [14:55] 27/03/2012 798237282059 798237282059
1 Nearside front tyre tread depth below requirements of 1.6mm (4.1.e.1) Nearside front tyre tread depth below requirements of 1.6mm (4.1.e.1) 18 December 2009 [12:59] 18/12/2009 824652759370 824652759370
1 Nearside rear tyre tread depth below requirements of 1.6mm (4.1.e.1) Nearside rear tyre tread depth below requirements of 1.6mm (4.1.e.1) 18 December 2009 [12:59] 18/12/2009 824652759370 824652759370
1 Rear body has a sharp edge caused by corrosion (6.1.c.1) Rear body has a sharp edge caused by corrosion (6.1.c.1) 18 December 2009 [12:59] 18/12/2009 824652759370 824652759370
1 Offside front sub-frame has excessive play in a pin/bush (2.4.g.2) Offside front sub-frame has excessive play in a pin/bush (2.4.g.2) 18 December 2009 [12:59] 18/12/2009 824652759370 824652759370
1 Nearside front vehicle structure has excessive corrosion, seriously affecting its strength within 30cm of the body mountings (6.1.b.2) Nearside front vehicle structure has excessive corrosion, seriously affecting its strength within 30cm of the body mountings (6.1.b.2) 18 December 2009 [12:59] 18/12/2009 824652759370 824652759370
1 Offside front vehicle structure has excessive corrosion, seriously affecting its strength within 30cm of the body mountings (6.1.b.2) Offside front vehicle structure has excessive corrosion, seriously affecting its strength within 30cm of the body mountings (6.1.b.2) 18 December 2009 [12:59] 18/12/2009 824652759370 824652759370
1 Nearside outer vehicle structure has excessive corrosion, seriously affecting its strength within 30cm of the body mountings (6.1.b.2) Nearside outer vehicle structure has excessive corrosion, seriously affecting its strength within 30cm of the body mountings (6.1.b.2) 18 December 2009 [12:59] 18/12/2009 824652759370 824652759370
1 Offside rear vehicle structure has excessive corrosion, seriously affecting its strength within 30cm of the body mountings (6.1.b.2) Offside rear vehicle structure has excessive corrosion, seriously affecting its strength within 30cm of the body mountings (6.1.b.2) 18 December 2009 [12:59] 18/12/2009 824652759370 824652759370
1 Service brake: efficiency below requirements (3.7.b.7) Service brake: efficiency below requirements (3.7.b.7) 18 December 2009 [12:59] 18/12/2009 824652759370 824652759370
1 Parking brake: efficiency below requirements (3.7.b.7) Parking brake: efficiency below requirements (3.7.b.7) 18 December 2009 [12:59] 18/12/2009 824652759370 824652759370

ALL ESJ 765 User Entered Faults [1]

ALL User Entered faults, ORDERED by OCCURRENCE DURING ESJ 765's MOT HISTORY
ALL ESJ 765 User Entered Faults [1]
ALL User Entered faults, ORDERED by OCCURRENCE DURING ESJ 765's MOT HISTORY
Fail Faults | source www.vehiclestats.co.uk
Fault Fault Test Date Test Date/Time Reference MOT Test Reference
1 Oil leak Oil leak 18 September 2014 [15:49] 18/09/2014 449951164230 449951164230

MOT TEST: 17 November 2017 16:56:18 PASSED
MOT TEST: 17 November 2017 16:56:18 PASSED

This test (506557072717) was completed on the 17 November 2017 16:56:18 and PASSED the requirements for a valid MOT with 0 comments.

This test (506557072717) was completed on the 17 November 2017 16:56:18 and PASSED the requirements for a valid MOT with 0 comments.

Recorded mileage: 51,278

Recorded mileage: 51,278


MOT TEST: 09 November 2017 13:36:21 FAILED
MOT TEST: 09 November 2017 13:36:21 FAILED

This test (912809518236) was completed on the 09 November 2017 13:36:21 and FAILED the requirements for a valid MOT with 5 comments.

This test (912809518236) was completed on the 09 November 2017 13:36:21 and FAILED the requirements for a valid MOT with 5 comments.

Recorded mileage: 51,278

Recorded mileage: 51,278


FAIL


MOT TEST: 23 November 2015 13:42:20 PASSED
MOT TEST: 23 November 2015 13:42:20 PASSED

This test (363198249304) was completed on the 23 November 2015 13:42:20 and PASSED the requirements for a valid MOT with 2 comments.

This test (363198249304) was completed on the 23 November 2015 13:42:20 and PASSED the requirements for a valid MOT with 2 comments.

Recorded mileage: 51,167

Recorded mileage: 51,167


ADVISORY


MOT TEST: 17 November 2015 11:49:49 FAILED
MOT TEST: 17 November 2015 11:49:49 FAILED

This test (927723414977) was completed on the 17 November 2015 11:49:49 and FAILED the requirements for a valid MOT with 4 comments.

This test (927723414977) was completed on the 17 November 2015 11:49:49 and FAILED the requirements for a valid MOT with 4 comments.

Recorded mileage: 51,166

Recorded mileage: 51,166


ADVISORY

FAIL


MOT TEST: 26 November 2014 16:36:47 PASSED
MOT TEST: 26 November 2014 16:36:47 PASSED

This test (185210934355) was completed on the 26 November 2014 16:36:47 and PASSED the requirements for a valid MOT with 0 comments.

This test (185210934355) was completed on the 26 November 2014 16:36:47 and PASSED the requirements for a valid MOT with 0 comments.

Recorded mileage: 50,876

Recorded mileage: 50,876


MOT TEST: 10 November 2014 15:20:27 FAILED
MOT TEST: 10 November 2014 15:20:27 FAILED

This test (525574214308) was completed on the 10 November 2014 15:20:27 and FAILED the requirements for a valid MOT with 19 comments.

This test (525574214308) was completed on the 10 November 2014 15:20:27 and FAILED the requirements for a valid MOT with 19 comments.

Recorded mileage: 50,870

Recorded mileage: 50,870


FAIL


MOT TEST: 18 September 2014 15:49:09 FAILED
MOT TEST: 18 September 2014 15:49:09 FAILED

This test (449951164230) was completed on the 18 September 2014 15:49:09 and FAILED the requirements for a valid MOT with 12 comments.

This test (449951164230) was completed on the 18 September 2014 15:49:09 and FAILED the requirements for a valid MOT with 12 comments.

Recorded mileage: 50,835

Recorded mileage: 50,835


ADVISORY

FAIL

USER ENTERED


MOT TEST: 18 May 2012 16:05:28 PASSED
MOT TEST: 18 May 2012 16:05:28 PASSED

This test (229579232452) was completed on the 18 May 2012 16:05:28 and PASSED the requirements for a valid MOT with 0 comments.

This test (229579232452) was completed on the 18 May 2012 16:05:28 and PASSED the requirements for a valid MOT with 0 comments.

Recorded mileage: 48,577

Recorded mileage: 48,577


MOT TEST: 12 May 2012 11:51:56 FAILED
MOT TEST: 12 May 2012 11:51:56 FAILED

This test (537493632125) was completed on the 12 May 2012 11:51:56 and FAILED the requirements for a valid MOT with 5 comments.

This test (537493632125) was completed on the 12 May 2012 11:51:56 and FAILED the requirements for a valid MOT with 5 comments.

Recorded mileage: 48,577

Recorded mileage: 48,577


FAIL


MOT TEST: 27 March 2012 14:55:31 FAILED
MOT TEST: 27 March 2012 14:55:31 FAILED

This test (798237282059) was completed on the 27 March 2012 14:55:31 and FAILED the requirements for a valid MOT with 4 comments.

This test (798237282059) was completed on the 27 March 2012 14:55:31 and FAILED the requirements for a valid MOT with 4 comments.

Recorded mileage: 48,551

Recorded mileage: 48,551


ADVISORY

FAIL


MOT TEST: 29 March 2011 14:11:31 PASSED
MOT TEST: 29 March 2011 14:11:31 PASSED

This test (875488781006) was completed on the 29 March 2011 14:11:31 and PASSED the requirements for a valid MOT with 0 comments.

This test (875488781006) was completed on the 29 March 2011 14:11:31 and PASSED the requirements for a valid MOT with 0 comments.

Recorded mileage: 46,971

Recorded mileage: 46,971


MOT TEST: 07 January 2010 15:53:56 PASSED
MOT TEST: 07 January 2010 15:53:56 PASSED

This test (744907600065) was completed on the 07 January 2010 15:53:56 and PASSED the requirements for a valid MOT with 0 comments.

This test (744907600065) was completed on the 07 January 2010 15:53:56 and PASSED the requirements for a valid MOT with 0 comments.

Recorded mileage: 45,803

Recorded mileage: 45,803


MOT TEST: 18 December 2009 12:59:42 FAILED
MOT TEST: 18 December 2009 12:59:42 FAILED

This test (824652759370) was completed on the 18 December 2009 12:59:42 and FAILED the requirements for a valid MOT with 14 comments.

This test (824652759370) was completed on the 18 December 2009 12:59:42 and FAILED the requirements for a valid MOT with 14 comments.

Recorded mileage: 45,803

Recorded mileage: 45,803


ADVISORY

FAIL