EUG 342F


EUG342F is registered to a White 1968, Morris Mini cooper with a Petrol engine. It Failed its most recent MOT Test on the 06 May 2008

9 unique faults (9 Total) reported in its MOT History (5 Tests).

0 common/recurring faults.

60% (3) MOT Pass Rate and a 40% (2) MOT Failure Rate.

28,783 recorded miles.

EUG 342F


EUG342F is registered to a White 1968, Morris Mini cooper with a Petrol engine. It Failed its most recent MOT Test on the 06 May 2008

9 unique faults (9 Total) reported in its MOT History (5 Tests).

0 common/recurring faults.

60% (3) MOT Pass Rate and a 40% (2) MOT Failure Rate.

28,783 recorded miles.

MOT PASS/Failure rate for EUG 342F

all MOT test results for EUG 342F represented as a percentage
MOT PASS/Failure rate for EUG 342F
all MOT test results for EUG 342F represented as a percentage

PERCENTAGE OF VEHICLE FAULTS WITH EUG 342F

ALL REPORTED FAULTS, DISPLAYED BY PERCENTAGE OF OCCURRENCE DURING ALL MOT TESTS
PERCENTAGE OF VEHICLE FAULTS WITH EUG 342F
ALL REPORTED FAULTS, DISPLAYED BY PERCENTAGE OF OCCURRENCE DURING ALL MOT TESTS
ADVISORY

FAIL

EUG 342F annual Faults by type

ALL REPORTED FAULTS, DISPLAYED over time and categorised by type
EUG 342F annual Faults by type
ALL REPORTED FAULTS, DISPLAYED over time and categorised by type

ALL EUG 342F ADVISORIES [1]

ALL ADVISORIES, ORDERED by OCCURRENCE DURING EUG 342F's MOT HISTORY
ALL EUG 342F ADVISORIES [1]
ALL ADVISORIES, ORDERED by OCCURRENCE DURING EUG 342F's MOT HISTORY
Fail Faults | source www.vehiclestats.co.uk
Fault Fault Test Date Test Date/Time Reference MOT Test Reference
1 Tyre worn close to the legal limit (4.1.e.1) Tyre worn close to the legal limit (4.1.e.1) 28 April 2008 [16:40] 28/04/2008 601699618185 601699618185

ALL EUG 342F Failure Faults [8]

ALL Failure faults, ORDERED by OCCURRENCE DURING EUG 342F's MOT HISTORY
ALL EUG 342F Failure Faults [8]
ALL Failure faults, ORDERED by OCCURRENCE DURING EUG 342F's MOT HISTORY
Fail Faults | source www.vehiclestats.co.uk
Fault Fault Test Date Test Date/Time Reference MOT Test Reference
1 Hazard warning lamps not flashing in phase, with ignition on (1.4.b.1f) Hazard warning lamps not flashing in phase, with ignition on (1.4.b.1f) 28 April 2008 [16:40] 28/04/2008 601699618185 601699618185
1 Hazard warning lamps not flashing in phase, with ignition off (1.4.b.1f) Hazard warning lamps not flashing in phase, with ignition off (1.4.b.1f) 28 April 2008 [16:40] 28/04/2008 601699618185 601699618185
1 Nearside outer front constant velocity joint gaiter insecurely mounted to its housing (2.5.c.1a) Nearside outer front constant velocity joint gaiter insecurely mounted to its housing (2.5.c.1a) 28 April 2008 [16:40] 28/04/2008 601699618185 601699618185
1 Brake pipe leaking (3.6.a.1) Brake pipe leaking (3.6.a.1) 28 April 2008 [16:40] 28/04/2008 601699618185 601699618185
1 Nearside outer suspension component mounting prescribed area is excessively corroded (2.4.a.3) Nearside outer suspension component mounting prescribed area is excessively corroded (2.4.a.3) 28 April 2008 [16:40] 28/04/2008 601699618185 601699618185
1 Offside outer suspension component mounting prescribed area is excessively corroded (2.4.a.3) Offside outer suspension component mounting prescribed area is excessively corroded (2.4.a.3) 28 April 2008 [16:40] 28/04/2008 601699618185 601699618185
1 Rear sub-frame corroded and seriously weakened (2.4.g.1) Rear sub-frame corroded and seriously weakened (2.4.g.1) 26 April 2007 [11:52] 26/04/2007 980826317161 980826317161
1 Nearside rear suspension component mounting prescribed area is excessively corroded (2.4.a.3) Nearside rear suspension component mounting prescribed area is excessively corroded (2.4.a.3) 26 April 2007 [11:52] 26/04/2007 980826317161 980826317161

MOT TEST: 06 May 2008 08:01:11 PASSED
MOT TEST: 06 May 2008 08:01:11 PASSED

This test (131077128116) was completed on the 06 May 2008 08:01:11 and PASSED the requirements for a valid MOT with 0 comments.

This test (131077128116) was completed on the 06 May 2008 08:01:11 and PASSED the requirements for a valid MOT with 0 comments.

Recorded mileage: 28,783

Recorded mileage: 28,783


MOT TEST: 28 April 2008 16:40:06 FAILED
MOT TEST: 28 April 2008 16:40:06 FAILED

This test (601699618185) was completed on the 28 April 2008 16:40:06 and FAILED the requirements for a valid MOT with 7 comments.

This test (601699618185) was completed on the 28 April 2008 16:40:06 and FAILED the requirements for a valid MOT with 7 comments.

Recorded mileage: 28,783

Recorded mileage: 28,783


ADVISORY

FAIL


MOT TEST: 03 May 2007 11:02:08 PASSED
MOT TEST: 03 May 2007 11:02:08 PASSED

This test (324543327128) was completed on the 03 May 2007 11:02:08 and PASSED the requirements for a valid MOT with 0 comments.

This test (324543327128) was completed on the 03 May 2007 11:02:08 and PASSED the requirements for a valid MOT with 0 comments.

Recorded mileage: 28,670

Recorded mileage: 28,670


MOT TEST: 26 April 2007 11:52:56 FAILED
MOT TEST: 26 April 2007 11:52:56 FAILED

This test (980826317161) was completed on the 26 April 2007 11:52:56 and FAILED the requirements for a valid MOT with 2 comments.

This test (980826317161) was completed on the 26 April 2007 11:52:56 and FAILED the requirements for a valid MOT with 2 comments.

Recorded mileage: 28,667

Recorded mileage: 28,667


FAIL


MOT TEST: 20 April 2006 13:08:59 PASSED
MOT TEST: 20 April 2006 13:08:59 PASSED

This test (812190716168) was completed on the 20 April 2006 13:08:59 and PASSED the requirements for a valid MOT with 0 comments.

This test (812190716168) was completed on the 20 April 2006 13:08:59 and PASSED the requirements for a valid MOT with 0 comments.

Recorded mileage: 27,031

Recorded mileage: 27,031