FD9 089


FD9089 is registered to a Black 1934, Morris with a Petrol engine. It Failed its most recent MOT Test on the 11 June 2012

7 unique faults (7 Total) reported in its MOT History (6 Tests).

0 common/recurring faults.

83% (5) MOT Pass Rate and a 17% (1) MOT Failure Rate.

69,365 recorded miles.

FD9 089


FD9089 is registered to a Black 1934, Morris with a Petrol engine. It Failed its most recent MOT Test on the 11 June 2012

7 unique faults (7 Total) reported in its MOT History (6 Tests).

0 common/recurring faults.

83% (5) MOT Pass Rate and a 17% (1) MOT Failure Rate.

69,365 recorded miles.

MOT PASS/Failure rate for FD9 089

all MOT test results for FD9 089 represented as a percentage
MOT PASS/Failure rate for FD9 089
all MOT test results for FD9 089 represented as a percentage

PERCENTAGE OF VEHICLE FAULTS WITH FD9 089

ALL REPORTED FAULTS, DISPLAYED BY PERCENTAGE OF OCCURRENCE DURING ALL MOT TESTS
PERCENTAGE OF VEHICLE FAULTS WITH FD9 089
ALL REPORTED FAULTS, DISPLAYED BY PERCENTAGE OF OCCURRENCE DURING ALL MOT TESTS
FAIL

FD9 089 annual Faults by type

ALL REPORTED FAULTS, DISPLAYED over time and categorised by type
FD9 089 annual Faults by type
ALL REPORTED FAULTS, DISPLAYED over time and categorised by type

ALL FD9 089 Failure Faults [7]

ALL Failure faults, ORDERED by OCCURRENCE DURING FD9 089's MOT HISTORY
ALL FD9 089 Failure Faults [7]
ALL Failure faults, ORDERED by OCCURRENCE DURING FD9 089's MOT HISTORY
Fail Faults | source www.vehiclestats.co.uk
Fault Fault Test Date Test Date/Time Reference MOT Test Reference
1 Rear stop lamp not working (1.2.1b) Rear stop lamp not working (1.2.1b) 15 March 2007 [18:23] 15/03/2007 142344777076 142344777076
1 Nearside semaphore indicator arm does not extend smoothly (1.4.c.1a) Nearside semaphore indicator arm does not extend smoothly (1.4.c.1a) 15 March 2007 [18:23] 15/03/2007 142344777076 142344777076
1 Nearside semaphore indicator arm arm does not show an amber light to the front (1.4.c.1b) Nearside semaphore indicator arm arm does not show an amber light to the front (1.4.c.1b) 15 March 2007 [18:23] 15/03/2007 142344777076 142344777076
1 Offside semaphore indicator arm does not extend smoothly (1.4.c.1a) Offside semaphore indicator arm does not extend smoothly (1.4.c.1a) 15 March 2007 [18:23] 15/03/2007 142344777076 142344777076
1 Rear exhaust has a major leak of exhaust gases (7.1.2) Rear exhaust has a major leak of exhaust gases (7.1.2) 15 March 2007 [18:23] 15/03/2007 142344777076 142344777076
1 Nearside front drag link end ball joint has excessive play (2.2.b.1f) Nearside front drag link end ball joint has excessive play (2.2.b.1f) 15 March 2007 [18:23] 15/03/2007 142344777076 142344777076
1 Steering box has relative movement between sector shaft and the drop arm (2.2.b.1b) Steering box has relative movement between sector shaft and the drop arm (2.2.b.1b) 15 March 2007 [18:23] 15/03/2007 142344777076 142344777076

MOT TEST: 11 June 2012 15:56:34 PASSED
MOT TEST: 11 June 2012 15:56:34 PASSED

This test (596573462157) was completed on the 11 June 2012 15:56:34 and PASSED the requirements for a valid MOT with 0 comments.

This test (596573462157) was completed on the 11 June 2012 15:56:34 and PASSED the requirements for a valid MOT with 0 comments.

Recorded mileage: 193

Recorded mileage: 193


MOT TEST: 13 October 2010 11:05:04 PASSED
MOT TEST: 13 October 2010 11:05:04 PASSED

This test (321446580498) was completed on the 13 October 2010 11:05:04 and PASSED the requirements for a valid MOT with 0 comments.

This test (321446580498) was completed on the 13 October 2010 11:05:04 and PASSED the requirements for a valid MOT with 0 comments.

Recorded mileage: 6

Recorded mileage: 6


MOT TEST: 23 April 2009 11:33:02 PASSED
MOT TEST: 23 April 2009 11:33:02 PASSED

This test (491693819158) was completed on the 23 April 2009 11:33:02 and PASSED the requirements for a valid MOT with 0 comments.

This test (491693819158) was completed on the 23 April 2009 11:33:02 and PASSED the requirements for a valid MOT with 0 comments.

Recorded mileage: 69,365

Recorded mileage: 69,365


MOT TEST: 28 April 2008 15:26:25 PASSED
MOT TEST: 28 April 2008 15:26:25 PASSED

This test (601539618106) was completed on the 28 April 2008 15:26:25 and PASSED the requirements for a valid MOT with 0 comments.

This test (601539618106) was completed on the 28 April 2008 15:26:25 and PASSED the requirements for a valid MOT with 0 comments.

Recorded mileage: 69,365

Recorded mileage: 69,365


MOT TEST: 19 April 2007 15:57:18 PASSED
MOT TEST: 19 April 2007 15:57:18 PASSED

This test (541899407186) was completed on the 19 April 2007 15:57:18 and PASSED the requirements for a valid MOT with 0 comments.

This test (541899407186) was completed on the 19 April 2007 15:57:18 and PASSED the requirements for a valid MOT with 0 comments.

Recorded mileage: 69,365

Recorded mileage: 69,365


MOT TEST: 15 March 2007 18:23:53 FAILED
MOT TEST: 15 March 2007 18:23:53 FAILED

This test (142344777076) was completed on the 15 March 2007 18:23:53 and FAILED the requirements for a valid MOT with 7 comments.

This test (142344777076) was completed on the 15 March 2007 18:23:53 and FAILED the requirements for a valid MOT with 7 comments.

Recorded mileage: 69,365

Recorded mileage: 69,365


FAIL