FMF 612V


FMF612V is registered to a Brown 1980, Morris Marina l with a Petrol engine. It Failed its most recent MOT Test on the 25 October 2007

12 unique faults (13 Total) reported in its MOT History (5 Tests).

1 common/recurring faults.

40% (2) MOT Pass Rate and a 60% (3) MOT Failure Rate.

48,413 recorded miles.

FMF 612V


FMF612V is registered to a Brown 1980, Morris Marina l with a Petrol engine. It Failed its most recent MOT Test on the 25 October 2007

12 unique faults (13 Total) reported in its MOT History (5 Tests).

1 common/recurring faults.

40% (2) MOT Pass Rate and a 60% (3) MOT Failure Rate.

48,413 recorded miles.

MOT PASS/Failure rate for FMF 612V

all MOT test results for FMF 612V represented as a percentage
MOT PASS/Failure rate for FMF 612V
all MOT test results for FMF 612V represented as a percentage

PERCENTAGE OF VEHICLE FAULTS WITH FMF 612V

ALL REPORTED FAULTS, DISPLAYED BY PERCENTAGE OF OCCURRENCE DURING ALL MOT TESTS
PERCENTAGE OF VEHICLE FAULTS WITH FMF 612V
ALL REPORTED FAULTS, DISPLAYED BY PERCENTAGE OF OCCURRENCE DURING ALL MOT TESTS
ADVISORY

FAIL

USER ENTERED

PASS WITH RECTIFICATION

FMF 612V annual Faults by type

ALL REPORTED FAULTS, DISPLAYED over time and categorised by type
FMF 612V annual Faults by type
ALL REPORTED FAULTS, DISPLAYED over time and categorised by type

ALL FMF 612V ADVISORIES [3]

ALL ADVISORIES, ORDERED by OCCURRENCE DURING FMF 612V's MOT HISTORY
ALL FMF 612V ADVISORIES [3]
ALL ADVISORIES, ORDERED by OCCURRENCE DURING FMF 612V's MOT HISTORY
Fail Faults | source www.vehiclestats.co.uk
Fault Fault Test Date Test Date/Time Reference MOT Test Reference
1 Rear brake pipe slightly corroded (3.6.b.2c) Rear brake pipe slightly corroded (3.6.b.2c) 25 October 2007 [10:11] 25/10/2007 362318497241 362318497241
1 Offside body has slight corrosion (6.1.b.2) Offside body has slight corrosion (6.1.b.2) 27 October 2006 [12:09] 27/10/2006 352830206362 352830206362
1 Offside rear brake pipe slightly corroded (3.6.b.2c) Offside rear brake pipe slightly corroded (3.6.b.2c) 27 October 2006 [12:09] 27/10/2006 352830206362 352830206362

ALL FMF 612V Failure Faults [7]

ALL Failure faults, ORDERED by OCCURRENCE DURING FMF 612V's MOT HISTORY
ALL FMF 612V Failure Faults [7]
ALL Failure faults, ORDERED by OCCURRENCE DURING FMF 612V's MOT HISTORY
Fail Faults | source www.vehiclestats.co.uk
Fault Fault Test Date Test Date/Time Reference MOT Test Reference
2 Registration plate lamp not working (1.1.5c) Registration plate lamp not working (1.1.5c) 25 October 2007 [10:11] 25/10/2007 27 October 2006 [12:09] 27/10/2006 362318497241 362318497241 352830206362 352830206362
1 Offside rear position lamp(s) excessively deteriorated so that it is not visible from a reasonable distance (1.1.a.3d) Offside rear position lamp(s) excessively deteriorated so that it is not visible from a reasonable distance (1.1.a.3d) 25 October 2007 [10:11] 25/10/2007 362318497241 362318497241
1 Offside front seat belt anchorage prescribed area is excessively corroded (5.2.6) Offside front seat belt anchorage prescribed area is excessively corroded (5.2.6) 25 October 2007 [10:11] 25/10/2007 362318497241 362318497241
1 Offside front body or chassis has excessive corrosion, seriously affecting its strength within 30cm of the body mountings (6.1.b.2) Offside front body or chassis has excessive corrosion, seriously affecting its strength within 30cm of the body mountings (6.1.b.2) 25 October 2007 [10:11] 25/10/2007 362318497241 362318497241
1 Nearside stop lamp not working (1.2.1b) Nearside stop lamp not working (1.2.1b) 27 October 2006 [12:09] 27/10/2006 352830206362 352830206362
1 Offside stop lamp not working (1.2.1b) Offside stop lamp not working (1.2.1b) 27 October 2006 [12:09] 27/10/2006 352830206362 352830206362

ALL FMF 612V User Entered Faults [1]

ALL User Entered faults, ORDERED by OCCURRENCE DURING FMF 612V's MOT HISTORY
ALL FMF 612V User Entered Faults [1]
ALL User Entered faults, ORDERED by OCCURRENCE DURING FMF 612V's MOT HISTORY
Fail Faults | source www.vehiclestats.co.uk
Fault Fault Test Date Test Date/Time Reference MOT Test Reference
1 Corrossion to nearside front lower wing and nearside boot floor Corrossion to nearside front lower wing and nearside boot floor 25 October 2007 [10:11] 25/10/2007 362318497241 362318497241

ALL FMF 612V Pass With Rectification Faults [2]

ALL Pass With Rectification faults, ORDERED by OCCURRENCE DURING FMF 612V's MOT HISTORY
ALL FMF 612V Pass With Rectification Faults [2]
ALL Pass With Rectification faults, ORDERED by OCCURRENCE DURING FMF 612V's MOT HISTORY
Pass With Rectification Faults | source www.vehiclestats.co.uk
Fault Fault Test Date Test Date/Time Reference MOT Test Reference
1 Offside rear rear position lamp(s) excessively deteriorated so that it is not visible from a reasonable distance (1.1.a.3d) Offside rear rear position lamp(s) excessively deteriorated so that it is not visible from a reasonable distance (1.1.a.3d) 27 October 2005 [17:26] 27/10/2005 444550405337 444550405337
1 Offside rear stop lamp adversely affected by the operation of another lamp (1.2.1f) Offside rear stop lamp adversely affected by the operation of another lamp (1.2.1f) 27 October 2005 [17:26] 27/10/2005 444550405337 444550405337

MOT TEST: 25 October 2007 10:11:04 FAILED
MOT TEST: 25 October 2007 10:11:04 FAILED

This test (362318497241) was completed on the 25 October 2007 10:11:04 and FAILED the requirements for a valid MOT with 6 comments.

This test (362318497241) was completed on the 25 October 2007 10:11:04 and FAILED the requirements for a valid MOT with 6 comments.

Recorded mileage: 48,413

Recorded mileage: 48,413


ADVISORY

FAIL

USER ENTERED


MOT TEST: 27 October 2006 16:33:26 PASSED
MOT TEST: 27 October 2006 16:33:26 PASSED

This test (483650606327) was completed on the 27 October 2006 16:33:26 and PASSED the requirements for a valid MOT with 0 comments.

This test (483650606327) was completed on the 27 October 2006 16:33:26 and PASSED the requirements for a valid MOT with 0 comments.

Recorded mileage: 48,383

Recorded mileage: 48,383


MOT TEST: 27 October 2006 12:09:04 FAILED
MOT TEST: 27 October 2006 12:09:04 FAILED

This test (352830206362) was completed on the 27 October 2006 12:09:04 and FAILED the requirements for a valid MOT with 5 comments.

This test (352830206362) was completed on the 27 October 2006 12:09:04 and FAILED the requirements for a valid MOT with 5 comments.

Recorded mileage: 48,383

Recorded mileage: 48,383


ADVISORY

FAIL


MOT TEST: 27 October 2005 17:26:28 PASSED
MOT TEST: 27 October 2005 17:26:28 PASSED

This test (373620205329) was completed on the 27 October 2005 17:26:28 and PASSED the requirements for a valid MOT with 0 comments.

This test (373620205329) was completed on the 27 October 2005 17:26:28 and PASSED the requirements for a valid MOT with 0 comments.

Recorded mileage: 48,342

Recorded mileage: 48,342


MOT TEST: 27 October 2005 17:26:28 FAILED
MOT TEST: 27 October 2005 17:26:28 FAILED

This test (444550405337) was completed on the 27 October 2005 17:26:28 and FAILED the requirements for a valid MOT with 2 comments.

This test (444550405337) was completed on the 27 October 2005 17:26:28 and FAILED the requirements for a valid MOT with 2 comments.

Recorded mileage: 48,342

Recorded mileage: 48,342


PASS WITH RECTIFICATION