FWT 756J


FWT756J is registered to a Green 1970, Morris Minor with a Petrol engine. It Passed its most recent MOT Test on the 12 April 2019

38 unique faults (42 Total) reported in its MOT History (15 Tests).

4 common/recurring faults, the most frequent (2 times) is: Brakes imbalanced across an axle (3.7.B.5b).

67% (10) MOT Pass Rate and a 33% (5) MOT Failure Rate.

17,689 recorded miles.

FWT 756J


FWT756J is registered to a Green 1970, Morris Minor with a Petrol engine. It Passed its most recent MOT Test on the 12 April 2019

38 unique faults (42 Total) reported in its MOT History (15 Tests).

4 common/recurring faults, the most frequent (2 times) is: Brakes imbalanced across an axle (3.7.B.5b).

67% (10) MOT Pass Rate and a 33% (5) MOT Failure Rate.

17,689 recorded miles.

MOT PASS/Failure rate for FWT 756J

all MOT test results for FWT 756J represented as a percentage
MOT PASS/Failure rate for FWT 756J
all MOT test results for FWT 756J represented as a percentage

PERCENTAGE OF VEHICLE FAULTS WITH FWT 756J

ALL REPORTED FAULTS, DISPLAYED BY PERCENTAGE OF OCCURRENCE DURING ALL MOT TESTS
PERCENTAGE OF VEHICLE FAULTS WITH FWT 756J
ALL REPORTED FAULTS, DISPLAYED BY PERCENTAGE OF OCCURRENCE DURING ALL MOT TESTS
ADVISORY

FAIL

USER ENTERED

FWT 756J annual Faults by type

ALL REPORTED FAULTS, DISPLAYED over time and categorised by type
FWT 756J annual Faults by type
ALL REPORTED FAULTS, DISPLAYED over time and categorised by type

RECURRING FAULTS WITH FWT 756J

FAULTS THAT HAVE OCCURED MORE THAN ONCE DURING FWT 756J's MOT HISTORY
RECURRING FAULTS WITH FWT 756J
FAULTS THAT HAVE OCCURED MORE THAN ONCE DURING FWT 756J's MOT HISTORY
Fault Fault Test Date Test Date/Time Reference MOT Test Reference
2 Brakes imbalanced across an axle (3.7.b.5b) Brakes imbalanced across an axle (3.7.b.5b) 05 June 2015 [14:08] 05/06/2015 12 June 2014 [09:54] 12/06/2014 696886655184 696886655184 197573964144 197573964144
2 Nearside front upper suspension arm has slight play in a pin/bush (2.4.g.2) Nearside front upper suspension arm has slight play in a pin/bush (2.4.g.2) 18 June 2014 [09:02] 18/06/2014 12 June 2014 [09:54] 12/06/2014 908729364147 908729364147 197573964144 197573964144
2 Near side and off side front floor pans heavely repaired and welded Near side and off side front floor pans heavely repaired and welded 18 June 2014 [09:02] 18/06/2014 12 June 2014 [09:54] 12/06/2014 908729364147 908729364147 197573964144 197573964144
2 Offside front body has slight corrosion (6.1.b.2) Offside front body has slight corrosion (6.1.b.2) 29 June 2012 [15:50] 29/06/2012 21 June 2012 [11:14] 21/06/2012 745101182104 745101182104 826853072173 826853072173

ALL FWT 756J ADVISORIES [11]

ALL ADVISORIES, ORDERED by OCCURRENCE DURING FWT 756J's MOT HISTORY
ALL FWT 756J ADVISORIES [11]
ALL ADVISORIES, ORDERED by OCCURRENCE DURING FWT 756J's MOT HISTORY
Advisory Faults | source www.vehiclestats.co.uk
Fault Fault Test Date Test Date/Time Reference MOT Test Reference
2 Nearside front upper suspension arm has slight play in a pin/bush (2.4.g.2) Nearside front upper suspension arm has slight play in a pin/bush (2.4.g.2) 18 June 2014 [09:02] 18/06/2014 12 June 2014 [09:54] 12/06/2014 908729364147 908729364147 197573964144 197573964144
2 Offside front body has slight corrosion (6.1.b.2) Offside front body has slight corrosion (6.1.b.2) 29 June 2012 [15:50] 29/06/2012 21 June 2012 [11:14] 21/06/2012 745101182104 745101182104 826853072173 826853072173
1 Nearside front suspension arm has slight play in a pin/bush (2.4.g.2) Nearside front suspension arm has slight play in a pin/bush (2.4.g.2) 05 June 2015 [14:08] 05/06/2015 696886655184 696886655184
1 Offside rear tyre worn close to the legal limit (4.1.e.1) Offside rear tyre worn close to the legal limit (4.1.e.1) 11 June 2013 [10:13] 11/06/2013 305382663132 305382663132
1 Nearside rear shock absorber has a light misting of oil (2.7.3) Nearside rear shock absorber has a light misting of oil (2.7.3) 11 June 2013 [10:13] 11/06/2013 305382663132 305382663132
1 Nearside front wheel bearing has slight play (2.5.a.3c) Nearside front wheel bearing has slight play (2.5.a.3c) 11 June 2013 [10:13] 11/06/2013 305382663132 305382663132
1 Rear parking brake: parking brake efficiency only just met. It would appear that the braking system requires adjustment or repair. (3.7.b.7) Rear parking brake: parking brake efficiency only just met. It would appear that the braking system requires adjustment or repair. (3.7.b.7) 11 June 2013 [10:13] 11/06/2013 305382663132 305382663132
1 Nearside outer front track rod end ball joint has slight play (2.2.b.1f) Nearside outer front track rod end ball joint has slight play (2.2.b.1f) 27 April 2011 [17:00] 27/04/2011 225387211432 225387211432
1 Offside outer front track rod end ball joint has slight play (2.2.b.1f) Offside outer front track rod end ball joint has slight play (2.2.b.1f) 27 April 2011 [17:00] 27/04/2011 225387211432 225387211432

ALL FWT 756J Failure Faults [26]

ALL Failure faults, ORDERED by OCCURRENCE DURING FWT 756J's MOT HISTORY
ALL FWT 756J Failure Faults [26]
ALL Failure faults, ORDERED by OCCURRENCE DURING FWT 756J's MOT HISTORY
Fail Faults | source www.vehiclestats.co.uk
Fault Fault Test Date Test Date/Time Reference MOT Test Reference
2 Brakes imbalanced across an axle (3.7.b.5b) Brakes imbalanced across an axle (3.7.b.5b) 05 June 2015 [14:08] 05/06/2015 12 June 2014 [09:54] 12/06/2014 696886655184 696886655184 197573964144 197573964144
1 Nearside inner front lower suspension component mounting prescribed area is excessively corroded (2.4.a.3) Nearside inner front lower suspension component mounting prescribed area is excessively corroded (2.4.a.3) 05 June 2015 [14:08] 05/06/2015 696886655184 696886655184
1 Offside inner rear lower suspension component mounting prescribed area is excessively corroded (2.4.a.3) Offside inner rear lower suspension component mounting prescribed area is excessively corroded (2.4.a.3) 05 June 2015 [14:08] 05/06/2015 696886655184 696886655184
1 Offside inner front suspension component mounting prescribed area is excessively corroded (2.4.a.3) Offside inner front suspension component mounting prescribed area is excessively corroded (2.4.a.3) 05 June 2015 [14:08] 05/06/2015 696886655184 696886655184
1 Nearside front lower tie bar/rod rubber bush deteriorated resulting in excessive movement (2.4.g.2) Nearside front lower tie bar/rod rubber bush deteriorated resulting in excessive movement (2.4.g.2) 05 June 2015 [14:08] 05/06/2015 696886655184 696886655184
1 Nearside front lower body has a sharp edge caused by corrosion (6.1.c.1) Nearside front lower body has a sharp edge caused by corrosion (6.1.c.1) 12 June 2014 [09:54] 12/06/2014 197573964144 197573964144
1 Offside rear lower body has a sharp edge caused by corrosion (6.1.c.1) Offside rear lower body has a sharp edge caused by corrosion (6.1.c.1) 12 June 2014 [09:54] 12/06/2014 197573964144 197573964144
1 Offside rear leaf spring slipper insecure (2.4.b.5) Offside rear leaf spring slipper insecure (2.4.b.5) 21 June 2012 [11:14] 21/06/2012 826853072173 826853072173
1 Nearside rear rear wheel bearing rough when rotated (2.6.1) Nearside rear rear wheel bearing rough when rotated (2.6.1) 21 June 2012 [11:14] 21/06/2012 826853072173 826853072173
1 Offside front track rod end ball joint has excessive play (2.2.b.1f) Offside front track rod end ball joint has excessive play (2.2.b.1f) 21 June 2012 [11:14] 21/06/2012 826853072173 826853072173
1 Nearside front track rod end ball joint dust cover excessively damaged so that it no longer prevents the ingress of dirt (2.2.c.1c) Nearside front track rod end ball joint dust cover excessively damaged so that it no longer prevents the ingress of dirt (2.2.c.1c) 21 June 2012 [11:14] 21/06/2012 826853072173 826853072173
1 Nearside tie bar/rod has excessive play in a ball joint (2.4.g.2) Nearside tie bar/rod has excessive play in a ball joint (2.4.g.2) 21 June 2012 [11:14] 21/06/2012 826853072173 826853072173
1 Nearside front body or chassis has excessive corrosion, seriously affecting its strength within 30cm of the body mountings (6.1.b.2) Nearside front body or chassis has excessive corrosion, seriously affecting its strength within 30cm of the body mountings (6.1.b.2) 21 June 2012 [11:14] 21/06/2012 826853072173 826853072173
1 Windscreen washer provides insufficient washer liquid (8.2.3) Windscreen washer provides insufficient washer liquid (8.2.3) 21 June 2012 [11:14] 21/06/2012 826853072173 826853072173
1 Nearside rear anti-roll bar has excessive play in a ball joint (2.4.g.2) Nearside rear anti-roll bar has excessive play in a ball joint (2.4.g.2) 21 June 2012 [11:14] 21/06/2012 826853072173 826853072173
1 Offside rear anti-roll bar has excessive play in a ball joint (2.4.g.2) Offside rear anti-roll bar has excessive play in a ball joint (2.4.g.2) 21 June 2012 [11:14] 21/06/2012 826853072173 826853072173
1 Nearside front steering rack gaiter split (2.2.d.2d) Nearside front steering rack gaiter split (2.2.d.2d) 27 April 2011 [17:00] 27/04/2011 225387211432 225387211432
1 Nearside rear suspension arm insecure (2.4.g.1) Nearside rear suspension arm insecure (2.4.g.1) 27 April 2011 [17:00] 27/04/2011 225387211432 225387211432
1 Offside rear suspension spring mounting prescribed area is excessively corroded (2.4.a.3) Offside rear suspension spring mounting prescribed area is excessively corroded (2.4.a.3) 27 April 2011 [17:00] 27/04/2011 225387211432 225387211432
1 Nearside windscreen washer provides insufficient washer liquid (8.2.3) Nearside windscreen washer provides insufficient washer liquid (8.2.3) 29 September 2009 [16:25] 29/09/2009 592172479293 592172479293
1 Offside windscreen washer provides insufficient washer liquid (8.2.3) Offside windscreen washer provides insufficient washer liquid (8.2.3) 29 September 2009 [16:25] 29/09/2009 592172479293 592172479293
1 Offside front position lamp(s) not working (1.1.a.3b) Offside front position lamp(s) not working (1.1.a.3b) 29 September 2009 [16:25] 29/09/2009 592172479293 592172479293
1 Registration plate lamp not working (1.1.c.1d) Registration plate lamp not working (1.1.c.1d) 29 September 2009 [16:25] 29/09/2009 592172479293 592172479293
1 Nearside rear brake recording little or no effort (3.7.b.5a) Nearside rear brake recording little or no effort (3.7.b.5a) 29 September 2009 [16:25] 29/09/2009 592172479293 592172479293
1 Service brake: efficiency below requirements (3.7.b.7) Service brake: efficiency below requirements (3.7.b.7) 29 September 2009 [16:25] 29/09/2009 592172479293 592172479293

ALL FWT 756J User Entered Faults [5]

ALL User Entered faults, ORDERED by OCCURRENCE DURING FWT 756J's MOT HISTORY
ALL FWT 756J User Entered Faults [5]
ALL User Entered faults, ORDERED by OCCURRENCE DURING FWT 756J's MOT HISTORY
Advisory Faults | source www.vehiclestats.co.uk
Fault Fault Test Date Test Date/Time Reference MOT Test Reference
2 Near side and off side front floor pans heavely repaired and welded Near side and off side front floor pans heavely repaired and welded 18 June 2014 [09:02] 18/06/2014 12 June 2014 [09:54] 12/06/2014 908729364147 908729364147 197573964144 197573964144
1 Both front and off side rear tyres perished and splitting and both front outter wings repaired with tape over corroded areas Both front and off side rear tyres perished and splitting and both front outter wings repaired with tape over corroded areas 05 June 2015 [14:08] 05/06/2015 696886655184 696886655184
1 Nearside and offside front top trunion bushes worn Nearside and offside front top trunion bushes worn 11 June 2013 [10:13] 11/06/2013 305382663132 305382663132
1 Nearside outer track rod end joint cover split/missing Nearside outer track rod end joint cover split/missing 27 April 2011 [17:00] 27/04/2011 225387211432 225387211432

MOT TEST: 12 April 2019 11:54:20 PASSED
MOT TEST: 12 April 2019 11:54:20 PASSED

This test (155639501573) was completed on the 12 April 2019 11:54:20 and PASSED the requirements for a valid MOT with 0 comments.

This test (155639501573) was completed on the 12 April 2019 11:54:20 and PASSED the requirements for a valid MOT with 0 comments.

Recorded mileage: 17,689

Recorded mileage: 17,689


MOT TEST: 05 June 2015 14:08:39 FAILED
MOT TEST: 05 June 2015 14:08:39 FAILED

This test (696886655184) was completed on the 05 June 2015 14:08:39 and FAILED the requirements for a valid MOT with 7 comments.

This test (696886655184) was completed on the 05 June 2015 14:08:39 and FAILED the requirements for a valid MOT with 7 comments.

Recorded mileage: 17,631

Recorded mileage: 17,631


ADVISORY

FAIL

USER ENTERED


MOT TEST: 18 June 2014 09:02:51 PASSED
MOT TEST: 18 June 2014 09:02:51 PASSED

This test (908729364147) was completed on the 18 June 2014 09:02:51 and PASSED the requirements for a valid MOT with 2 comments.

This test (908729364147) was completed on the 18 June 2014 09:02:51 and PASSED the requirements for a valid MOT with 2 comments.

Recorded mileage: 17,275

Recorded mileage: 17,275


ADVISORY

USER ENTERED


MOT TEST: 12 June 2014 09:54:26 FAILED
MOT TEST: 12 June 2014 09:54:26 FAILED

This test (197573964144) was completed on the 12 June 2014 09:54:26 and FAILED the requirements for a valid MOT with 5 comments.

This test (197573964144) was completed on the 12 June 2014 09:54:26 and FAILED the requirements for a valid MOT with 5 comments.

Recorded mileage: 17,265

Recorded mileage: 17,265


ADVISORY

FAIL

USER ENTERED


MOT TEST: 11 June 2013 10:13:49 PASSED
MOT TEST: 11 June 2013 10:13:49 PASSED

This test (305382663132) was completed on the 11 June 2013 10:13:49 and PASSED the requirements for a valid MOT with 5 comments.

This test (305382663132) was completed on the 11 June 2013 10:13:49 and PASSED the requirements for a valid MOT with 5 comments.

Recorded mileage: 16,822

Recorded mileage: 16,822


ADVISORY

USER ENTERED


MOT TEST: 29 June 2012 15:50:30 PASSED
MOT TEST: 29 June 2012 15:50:30 PASSED

This test (745101182104) was completed on the 29 June 2012 15:50:30 and PASSED the requirements for a valid MOT with 1 comments.

This test (745101182104) was completed on the 29 June 2012 15:50:30 and PASSED the requirements for a valid MOT with 1 comments.

Recorded mileage: 1,516

Recorded mileage: 1,516


ADVISORY


MOT TEST: 21 June 2012 11:14:21 FAILED
MOT TEST: 21 June 2012 11:14:21 FAILED

This test (826853072173) was completed on the 21 June 2012 11:14:21 and FAILED the requirements for a valid MOT with 10 comments.

This test (826853072173) was completed on the 21 June 2012 11:14:21 and FAILED the requirements for a valid MOT with 10 comments.

Recorded mileage: 1,513

Recorded mileage: 1,513


ADVISORY

FAIL


MOT TEST: 05 May 2011 14:15:15 PASSED
MOT TEST: 05 May 2011 14:15:15 PASSED

This test (977735221157) was completed on the 05 May 2011 14:15:15 and PASSED the requirements for a valid MOT with 0 comments.

This test (977735221157) was completed on the 05 May 2011 14:15:15 and PASSED the requirements for a valid MOT with 0 comments.

Recorded mileage: 10,011

Recorded mileage: 10,011


MOT TEST: 27 April 2011 17:00:01 FAILED
MOT TEST: 27 April 2011 17:00:01 FAILED

This test (225387211432) was completed on the 27 April 2011 17:00:01 and FAILED the requirements for a valid MOT with 6 comments.

This test (225387211432) was completed on the 27 April 2011 17:00:01 and FAILED the requirements for a valid MOT with 6 comments.

Recorded mileage: 10,007

Recorded mileage: 10,007


ADVISORY

FAIL

USER ENTERED


MOT TEST: 29 October 2010 11:42:41 PASSED
MOT TEST: 29 October 2010 11:42:41 PASSED

This test (430312800407) was completed on the 29 October 2010 11:42:41 and PASSED the requirements for a valid MOT with 0 comments.

This test (430312800407) was completed on the 29 October 2010 11:42:41 and PASSED the requirements for a valid MOT with 0 comments.

Recorded mileage: 8,143

Recorded mileage: 8,143


MOT TEST: 07 October 2009 16:56:15 PASSED
MOT TEST: 07 October 2009 16:56:15 PASSED

This test (312430489282) was completed on the 07 October 2009 16:56:15 and PASSED the requirements for a valid MOT with 0 comments.

This test (312430489282) was completed on the 07 October 2009 16:56:15 and PASSED the requirements for a valid MOT with 0 comments.

Recorded mileage: 5,220

Recorded mileage: 5,220


MOT TEST: 29 September 2009 16:25:39 FAILED
MOT TEST: 29 September 2009 16:25:39 FAILED

This test (592172479293) was completed on the 29 September 2009 16:25:39 and FAILED the requirements for a valid MOT with 6 comments.

This test (592172479293) was completed on the 29 September 2009 16:25:39 and FAILED the requirements for a valid MOT with 6 comments.

Recorded mileage: 5,193

Recorded mileage: 5,193


FAIL


MOT TEST: 11 June 2008 09:07:46 PASSED
MOT TEST: 11 June 2008 09:07:46 PASSED

This test (581713968169) was completed on the 11 June 2008 09:07:46 and PASSED the requirements for a valid MOT with 0 comments.

This test (581713968169) was completed on the 11 June 2008 09:07:46 and PASSED the requirements for a valid MOT with 0 comments.

Recorded mileage: 3,002

Recorded mileage: 3,002


MOT TEST: 04 May 2007 11:29:03 PASSED
MOT TEST: 04 May 2007 11:29:03 PASSED

This test (644004627191) was completed on the 04 May 2007 11:29:03 and PASSED the requirements for a valid MOT with 0 comments.

This test (644004627191) was completed on the 04 May 2007 11:29:03 and PASSED the requirements for a valid MOT with 0 comments.

Recorded mileage: 2,458

Recorded mileage: 2,458


MOT TEST: 12 May 2006 09:24:57 PASSED
MOT TEST: 12 May 2006 09:24:57 PASSED

This test (874512236123) was completed on the 12 May 2006 09:24:57 and PASSED the requirements for a valid MOT with 0 comments.

This test (874512236123) was completed on the 12 May 2006 09:24:57 and PASSED the requirements for a valid MOT with 0 comments.

Recorded mileage: 1,811

Recorded mileage: 1,811