HCK 148E


HCK148E is registered to a Blue 1967, Morris Minor with a Petrol engine. It Failed its most recent MOT Test on the 04 August 2006

9 unique faults (11 Total) reported in its MOT History (3 Tests).

1 common/recurring faults.

33% (1) MOT Pass Rate and a 67% (2) MOT Failure Rate.

88,732 recorded miles.

HCK 148E


HCK148E is registered to a Blue 1967, Morris Minor with a Petrol engine. It Failed its most recent MOT Test on the 04 August 2006

9 unique faults (11 Total) reported in its MOT History (3 Tests).

1 common/recurring faults.

33% (1) MOT Pass Rate and a 67% (2) MOT Failure Rate.

88,732 recorded miles.

MOT PASS/Failure rate for HCK 148E

all MOT test results for HCK 148E represented as a percentage
MOT PASS/Failure rate for HCK 148E
all MOT test results for HCK 148E represented as a percentage

PERCENTAGE OF VEHICLE FAULTS WITH HCK 148E

ALL REPORTED FAULTS, DISPLAYED BY PERCENTAGE OF OCCURRENCE DURING ALL MOT TESTS
PERCENTAGE OF VEHICLE FAULTS WITH HCK 148E
ALL REPORTED FAULTS, DISPLAYED BY PERCENTAGE OF OCCURRENCE DURING ALL MOT TESTS
FAIL

HCK 148E annual Faults by type

ALL REPORTED FAULTS, DISPLAYED over time and categorised by type
HCK 148E annual Faults by type
ALL REPORTED FAULTS, DISPLAYED over time and categorised by type

ALL HCK 148E Failure Faults [11]

ALL Failure faults, ORDERED by OCCURRENCE DURING HCK 148E's MOT HISTORY
ALL HCK 148E Failure Faults [11]
ALL Failure faults, ORDERED by OCCURRENCE DURING HCK 148E's MOT HISTORY
Fail Faults | source www.vehiclestats.co.uk
Fault Fault Test Date Test Date/Time Reference MOT Test Reference
2 Offside rear suspension component mounting prescribed area is excessively corroded (2.4.a.3) Offside rear suspension component mounting prescribed area is excessively corroded (2.4.a.3) 01 August 2006 [15:18] 01/08/2006 19 July 2006 [17:46] 19/07/2006 991053516236 991053516236 351240506266 351240506266
1 Brakes imbalanced across an axle (3.7.b.5b) Brakes imbalanced across an axle (3.7.b.5b) 01 August 2006 [15:18] 01/08/2006 991053516236 991053516236
1 Offside suspension component mounting prescribed area is excessively corroded (2.4.a.3) Offside suspension component mounting prescribed area is excessively corroded (2.4.a.3) 19 July 2006 [17:46] 19/07/2006 351240506266 351240506266
1 Offside seat belt anchorage prescribed area is excessively corroded (5.2.6) Offside seat belt anchorage prescribed area is excessively corroded (5.2.6) 19 July 2006 [17:46] 19/07/2006 351240506266 351240506266
1 Front brake application uneven (3.7.b.2) Front brake application uneven (3.7.b.2) 19 July 2006 [17:46] 19/07/2006 351240506266 351240506266
1 Rear brake recording little or no effort (3.7.b.5a) Rear brake recording little or no effort (3.7.b.5a) 19 July 2006 [17:46] 19/07/2006 351240506266 351240506266
1 Rear parking brake recording little or no effort (3.7.b.6a) Rear parking brake recording little or no effort (3.7.b.6a) 19 July 2006 [17:46] 19/07/2006 351240506266 351240506266
1 Service brake: efficiency below requirements (3.7.b.7) Service brake: efficiency below requirements (3.7.b.7) 19 July 2006 [17:46] 19/07/2006 351240506266 351240506266
1 Parking brake: efficiency below requirements (3.7.b.7) Parking brake: efficiency below requirements (3.7.b.7) 19 July 2006 [17:46] 19/07/2006 351240506266 351240506266

MOT TEST: 04 August 2006 12:41:20 PASSED
MOT TEST: 04 August 2006 12:41:20 PASSED

This test (420796716279) was completed on the 04 August 2006 12:41:20 and PASSED the requirements for a valid MOT with 0 comments.

This test (420796716279) was completed on the 04 August 2006 12:41:20 and PASSED the requirements for a valid MOT with 0 comments.

Recorded mileage: 88,732

Recorded mileage: 88,732


MOT TEST: 01 August 2006 15:18:34 FAILED
MOT TEST: 01 August 2006 15:18:34 FAILED

This test (991053516236) was completed on the 01 August 2006 15:18:34 and FAILED the requirements for a valid MOT with 2 comments.

This test (991053516236) was completed on the 01 August 2006 15:18:34 and FAILED the requirements for a valid MOT with 2 comments.

Recorded mileage: 88,725

Recorded mileage: 88,725


FAIL


MOT TEST: 19 July 2006 17:46:09 FAILED
MOT TEST: 19 July 2006 17:46:09 FAILED

This test (351240506266) was completed on the 19 July 2006 17:46:09 and FAILED the requirements for a valid MOT with 9 comments.

This test (351240506266) was completed on the 19 July 2006 17:46:09 and FAILED the requirements for a valid MOT with 9 comments.

Recorded mileage: 77,811

Recorded mileage: 77,811


FAIL