HDV 553D


HDV553D is registered to a Green 1966, Morris Mini with a Petrol engine. It Failed its most recent MOT Test on the 10 December 2010

26 unique faults (26 Total) reported in its MOT History (6 Tests).

0 common/recurring faults.

67% (4) MOT Pass Rate and a 33% (2) MOT Failure Rate.

45,582 recorded miles.

HDV 553D


HDV553D is registered to a Green 1966, Morris Mini with a Petrol engine. It Failed its most recent MOT Test on the 10 December 2010

26 unique faults (26 Total) reported in its MOT History (6 Tests).

0 common/recurring faults.

67% (4) MOT Pass Rate and a 33% (2) MOT Failure Rate.

45,582 recorded miles.

MOT PASS/Failure rate for HDV 553D

all MOT test results for HDV 553D represented as a percentage
MOT PASS/Failure rate for HDV 553D
all MOT test results for HDV 553D represented as a percentage

PERCENTAGE OF VEHICLE FAULTS WITH HDV 553D

ALL REPORTED FAULTS, DISPLAYED BY PERCENTAGE OF OCCURRENCE DURING ALL MOT TESTS
PERCENTAGE OF VEHICLE FAULTS WITH HDV 553D
ALL REPORTED FAULTS, DISPLAYED BY PERCENTAGE OF OCCURRENCE DURING ALL MOT TESTS
ADVISORY

FAIL

USER ENTERED

HDV 553D annual Faults by type

ALL REPORTED FAULTS, DISPLAYED over time and categorised by type
HDV 553D annual Faults by type
ALL REPORTED FAULTS, DISPLAYED over time and categorised by type

ALL HDV 553D ADVISORIES [3]

ALL ADVISORIES, ORDERED by OCCURRENCE DURING HDV 553D's MOT HISTORY
ALL HDV 553D ADVISORIES [3]
ALL ADVISORIES, ORDERED by OCCURRENCE DURING HDV 553D's MOT HISTORY
Fail Faults | source www.vehiclestats.co.uk
Fault Fault Test Date Test Date/Time Reference MOT Test Reference
1 Exhaust has a minor leak of exhaust gases (7.1.2) Exhaust has a minor leak of exhaust gases (7.1.2) 02 August 2008 [11:00] 02/08/2008 794815518217 794815518217
1 Nearside front suspension has slight play in a upper suspension ball joint (2.5.b.1a) Nearside front suspension has slight play in a upper suspension ball joint (2.5.b.1a) 02 August 2008 [11:00] 02/08/2008 794815518217 794815518217
1 Offside rear subframe mounting prescribed area is corroded but not considered excessive (2.4.a.3) Offside rear subframe mounting prescribed area is corroded but not considered excessive (2.4.a.3) 14 May 2007 [10:45] 14/05/2007 293384837445 293384837445

ALL HDV 553D Failure Faults [16]

ALL Failure faults, ORDERED by OCCURRENCE DURING HDV 553D's MOT HISTORY
ALL HDV 553D Failure Faults [16]
ALL Failure faults, ORDERED by OCCURRENCE DURING HDV 553D's MOT HISTORY
Fail Faults | source www.vehiclestats.co.uk
Fault Fault Test Date Test Date/Time Reference MOT Test Reference
1 Steering column retaining device insecure (2.1.6) Steering column retaining device insecure (2.1.6) 02 August 2008 [11:00] 02/08/2008 794815518217 794815518217
1 Nearside front constant velocity joint gaiter split (2.5.c.1a) Nearside front constant velocity joint gaiter split (2.5.c.1a) 02 August 2008 [11:00] 02/08/2008 794815518217 794815518217
1 Nearside front position lamp(s) not working (1.1.a.3b) Nearside front position lamp(s) not working (1.1.a.3b) 14 May 2007 [10:45] 14/05/2007 293384837445 293384837445
1 Offside front position lamp(s) not working (1.1.a.3b) Offside front position lamp(s) not working (1.1.a.3b) 14 May 2007 [10:45] 14/05/2007 293384837445 293384837445
1 Nearside rear position lamp(s) excessively deteriorated so that it is not visible from a reasonable distance (1.1.a.3d) Nearside rear position lamp(s) excessively deteriorated so that it is not visible from a reasonable distance (1.1.a.3d) 14 May 2007 [10:45] 14/05/2007 293384837445 293384837445
1 Offside rear position lamp(s) excessively deteriorated so that it is not visible from a reasonable distance (1.1.a.3d) Offside rear position lamp(s) excessively deteriorated so that it is not visible from a reasonable distance (1.1.a.3d) 14 May 2007 [10:45] 14/05/2007 293384837445 293384837445
1 Horn not working (1.6.2a) Horn not working (1.6.2a) 14 May 2007 [10:45] 14/05/2007 293384837445 293384837445
1 Front direction indicators not working (1.4.a.2c) Front direction indicators not working (1.4.a.2c) 14 May 2007 [10:45] 14/05/2007 293384837445 293384837445
1 Rear direction indicators not working (1.4.a.2c) Rear direction indicators not working (1.4.a.2c) 14 May 2007 [10:45] 14/05/2007 293384837445 293384837445
1 Nearside stop lamp not working (1.2.1b) Nearside stop lamp not working (1.2.1b) 14 May 2007 [10:45] 14/05/2007 293384837445 293384837445
1 Offside stop lamp not working (1.2.1b) Offside stop lamp not working (1.2.1b) 14 May 2007 [10:45] 14/05/2007 293384837445 293384837445
1 Rear registration plate lamp not working (1.1.5c) Rear registration plate lamp not working (1.1.5c) 14 May 2007 [10:45] 14/05/2007 293384837445 293384837445
1 Front windscreen wiper does not clear the windscreen effectively (8.2.2) Front windscreen wiper does not clear the windscreen effectively (8.2.2) 14 May 2007 [10:45] 14/05/2007 293384837445 293384837445
1 Nearside rear subframe mounting prescribed area is excessively corroded (2.4.a.3) Nearside rear subframe mounting prescribed area is excessively corroded (2.4.a.3) 14 May 2007 [10:45] 14/05/2007 293384837445 293384837445
1 Nearside front front brake binding (3.7.b.1) Nearside front front brake binding (3.7.b.1) 14 May 2007 [10:45] 14/05/2007 293384837445 293384837445
1 Offside front front brake binding (3.7.b.1) Offside front front brake binding (3.7.b.1) 14 May 2007 [10:45] 14/05/2007 293384837445 293384837445

ALL HDV 553D User Entered Faults [7]

ALL User Entered faults, ORDERED by OCCURRENCE DURING HDV 553D's MOT HISTORY
ALL HDV 553D User Entered Faults [7]
ALL User Entered faults, ORDERED by OCCURRENCE DURING HDV 553D's MOT HISTORY
Fail Faults | source www.vehiclestats.co.uk
Fault Fault Test Date Test Date/Time Reference MOT Test Reference
1 Radiator overheating Radiator overheating 02 August 2008 [11:00] 02/08/2008 794815518217 794815518217
1 Front no plate detereorating Front no plate detereorating 02 August 2008 [11:00] 02/08/2008 794815518217 794815518217
1 Carb out of tune Carb out of tune 02 August 2008 [11:00] 02/08/2008 794815518217 794815518217
1 Nsf brake hose slightly twisted Nsf brake hose slightly twisted 02 August 2008 [11:00] 02/08/2008 794815518217 794815518217
1 Nsf bumpstop missing Nsf bumpstop missing 02 August 2008 [11:00] 02/08/2008 794815518217 794815518217
1 Nsf brake disc dust sheild missing Nsf brake disc dust sheild missing 02 August 2008 [11:00] 02/08/2008 794815518217 794815518217
1 Unable to check emissions as engine wont tick-over Unable to check emissions as engine wont tick-over 14 May 2007 [10:45] 14/05/2007 293384837445 293384837445

MOT TEST: 10 December 2010 15:05:29 PASSED
MOT TEST: 10 December 2010 15:05:29 PASSED

This test (274804140354) was completed on the 10 December 2010 15:05:29 and PASSED the requirements for a valid MOT with 0 comments.

This test (274804140354) was completed on the 10 December 2010 15:05:29 and PASSED the requirements for a valid MOT with 0 comments.

Recorded mileage: 45,582

Recorded mileage: 45,582


MOT TEST: 08 August 2008 11:13:37 PASSED
MOT TEST: 08 August 2008 11:13:37 PASSED

This test (403021228271) was completed on the 08 August 2008 11:13:37 and PASSED the requirements for a valid MOT with 0 comments.

This test (403021228271) was completed on the 08 August 2008 11:13:37 and PASSED the requirements for a valid MOT with 0 comments.

Recorded mileage: 45,479

Recorded mileage: 45,479


MOT TEST: 02 August 2008 11:00:50 FAILED
MOT TEST: 02 August 2008 11:00:50 FAILED

This test (794815518217) was completed on the 02 August 2008 11:00:50 and FAILED the requirements for a valid MOT with 10 comments.

This test (794815518217) was completed on the 02 August 2008 11:00:50 and FAILED the requirements for a valid MOT with 10 comments.

Recorded mileage: 45,479

Recorded mileage: 45,479


ADVISORY

FAIL

USER ENTERED


MOT TEST: 15 May 2007 11:56:35 PASSED
MOT TEST: 15 May 2007 11:56:35 PASSED

This test (732255237130) was completed on the 15 May 2007 11:56:35 and PASSED the requirements for a valid MOT with 0 comments.

This test (732255237130) was completed on the 15 May 2007 11:56:35 and PASSED the requirements for a valid MOT with 0 comments.

Recorded mileage: 44,959

Recorded mileage: 44,959


MOT TEST: 14 May 2007 10:45:32 FAILED
MOT TEST: 14 May 2007 10:45:32 FAILED

This test (293384837445) was completed on the 14 May 2007 10:45:32 and FAILED the requirements for a valid MOT with 16 comments.

This test (293384837445) was completed on the 14 May 2007 10:45:32 and FAILED the requirements for a valid MOT with 16 comments.

Recorded mileage: 44,959

Recorded mileage: 44,959


ADVISORY

FAIL

USER ENTERED


MOT TEST: 27 September 2005 09:47:47 PASSED
MOT TEST: 27 September 2005 09:47:47 PASSED

This test (462340775200) was completed on the 27 September 2005 09:47:47 and PASSED the requirements for a valid MOT with 0 comments.

This test (462340775200) was completed on the 27 September 2005 09:47:47 and PASSED the requirements for a valid MOT with 0 comments.

Recorded mileage: 44,956

Recorded mileage: 44,956