HEH 318D


HEH318D is registered to a Blue 1971, Morris Minor 1000 with a Petrol engine. It Failed its most recent MOT Test on the 21 July 2017

11 unique faults (12 Total) reported in its MOT History (13 Tests).

1 common/recurring faults.

77% (10) MOT Pass Rate and a 23% (3) MOT Failure Rate.

47,547 recorded miles.

HEH 318D


HEH318D is registered to a Blue 1971, Morris Minor 1000 with a Petrol engine. It Failed its most recent MOT Test on the 21 July 2017

11 unique faults (12 Total) reported in its MOT History (13 Tests).

1 common/recurring faults.

77% (10) MOT Pass Rate and a 23% (3) MOT Failure Rate.

47,547 recorded miles.

MOT PASS/Failure rate for HEH 318D

all MOT test results for HEH 318D represented as a percentage
MOT PASS/Failure rate for HEH 318D
all MOT test results for HEH 318D represented as a percentage

PERCENTAGE OF VEHICLE FAULTS WITH HEH 318D

ALL REPORTED FAULTS, DISPLAYED BY PERCENTAGE OF OCCURRENCE DURING ALL MOT TESTS
PERCENTAGE OF VEHICLE FAULTS WITH HEH 318D
ALL REPORTED FAULTS, DISPLAYED BY PERCENTAGE OF OCCURRENCE DURING ALL MOT TESTS
ADVISORY

FAIL

USER ENTERED

PASS WITH RECTIFICATION

HEH 318D annual Faults by type

ALL REPORTED FAULTS, DISPLAYED over time and categorised by type
HEH 318D annual Faults by type
ALL REPORTED FAULTS, DISPLAYED over time and categorised by type

ALL HEH 318D ADVISORIES [5]

ALL ADVISORIES, ORDERED by OCCURRENCE DURING HEH 318D's MOT HISTORY
ALL HEH 318D ADVISORIES [5]
ALL ADVISORIES, ORDERED by OCCURRENCE DURING HEH 318D's MOT HISTORY
Advisory Faults | source www.vehiclestats.co.uk
Fault Fault Test Date Test Date/Time Reference MOT Test Reference
1 Corrosion to n/s front wing /sill areas Corrosion to n/s front wing /sill areas 21 July 2017 [15:20] 21/07/2017 136917836275 136917836275
1 All weld repairs have been undersealed All weld repairs have been undersealed 22 July 2016 [16:03] 22/07/2016 165958158770 165958158770
1 Nearside front brake hose slightly deteriorated (3.6.b.4d) Nearside front brake hose slightly deteriorated (3.6.b.4d) 24 June 2011 [11:51] 24/06/2011 257825471456 257825471456
1 Centre rear brake hose slightly deteriorated (3.6.b.4d) Centre rear brake hose slightly deteriorated (3.6.b.4d) 24 June 2011 [11:51] 24/06/2011 257825471456 257825471456
1 Steering column top bearing slightly worn (2.1.2c) Steering column top bearing slightly worn (2.1.2c) 24 June 2011 [11:51] 24/06/2011 257825471456 257825471456

ALL HEH 318D Failure Faults [5]

ALL Failure faults, ORDERED by OCCURRENCE DURING HEH 318D's MOT HISTORY
ALL HEH 318D Failure Faults [5]
ALL Failure faults, ORDERED by OCCURRENCE DURING HEH 318D's MOT HISTORY
Fail Faults | source www.vehiclestats.co.uk
Fault Fault Test Date Test Date/Time Reference MOT Test Reference
1 Nearside rear brake recording little or no effort (3.7.b.5a) Nearside rear brake recording little or no effort (3.7.b.5a) 02 July 2013 [12:30] 02/07/2013 589263783119 589263783119
1 Nearside rear parking (secondary) brake grabbing severely (3.7.b.6b) Nearside rear parking (secondary) brake grabbing severely (3.7.b.6b) 02 July 2013 [12:30] 02/07/2013 589263783119 589263783119
1 Brakes imbalanced across an axle (3.7.b.5b) Brakes imbalanced across an axle (3.7.b.5b) 02 July 2013 [12:30] 02/07/2013 589263783119 589263783119
1 Nearside headlamp not working on main beam (1.7.5a) Nearside headlamp not working on main beam (1.7.5a) 29 June 2012 [11:45] 29/06/2012 239321082420 239321082420
1 Parking brake: efficiency below requirements (3.7.b.7) Parking brake: efficiency below requirements (3.7.b.7) 29 June 2012 [11:45] 29/06/2012 239321082420 239321082420

ALL HEH 318D User Entered Faults [1]

ALL User Entered faults, ORDERED by OCCURRENCE DURING HEH 318D's MOT HISTORY
ALL HEH 318D User Entered Faults [1]
ALL User Entered faults, ORDERED by OCCURRENCE DURING HEH 318D's MOT HISTORY
Advisory Faults | source www.vehiclestats.co.uk
Fault Fault Test Date Test Date/Time Reference MOT Test Reference
1 Underside of vehicle corroded Underside of vehicle corroded 24 June 2011 [11:51] 24/06/2011 257825471456 257825471456

ALL HEH 318D Pass With Rectification Faults [1]

ALL Pass With Rectification faults, ORDERED by OCCURRENCE DURING HEH 318D's MOT HISTORY
ALL HEH 318D Pass With Rectification Faults [1]
ALL Pass With Rectification faults, ORDERED by OCCURRENCE DURING HEH 318D's MOT HISTORY
Pass With Rectification Faults | source www.vehiclestats.co.uk
Fault Fault Test Date Test Date/Time Reference MOT Test Reference
1 Nearside headlamp not working on main beam (1.7.5a) Nearside headlamp not working on main beam (1.7.5a) 16 June 2015 [10:47] 16/06/2015 645437465114 645437465114

MOT TEST: 21 July 2017 15:20:50 PASSED
MOT TEST: 21 July 2017 15:20:50 PASSED

This test (136917836275) was completed on the 21 July 2017 15:20:50 and PASSED the requirements for a valid MOT with 1 comments.

This test (136917836275) was completed on the 21 July 2017 15:20:50 and PASSED the requirements for a valid MOT with 1 comments.

Recorded mileage: 47,547

Recorded mileage: 47,547


ADVISORY


MOT TEST: 22 July 2016 16:03:03 PASSED
MOT TEST: 22 July 2016 16:03:03 PASSED

This test (165958158770) was completed on the 22 July 2016 16:03:03 and PASSED the requirements for a valid MOT with 1 comments.

This test (165958158770) was completed on the 22 July 2016 16:03:03 and PASSED the requirements for a valid MOT with 1 comments.

Recorded mileage: 47,501

Recorded mileage: 47,501


ADVISORY


MOT TEST: 16 June 2015 10:47:21 PASSED
MOT TEST: 16 June 2015 10:47:21 PASSED

This test (499327265186) was completed on the 16 June 2015 10:47:21 and PASSED the requirements for a valid MOT with 0 comments.

This test (499327265186) was completed on the 16 June 2015 10:47:21 and PASSED the requirements for a valid MOT with 0 comments.

Recorded mileage: 47,276

Recorded mileage: 47,276


MOT TEST: 16 June 2015 10:47:21 FAILED
MOT TEST: 16 June 2015 10:47:21 FAILED

This test (645437465114) was completed on the 16 June 2015 10:47:21 and FAILED the requirements for a valid MOT with 1 comments.

This test (645437465114) was completed on the 16 June 2015 10:47:21 and FAILED the requirements for a valid MOT with 1 comments.

Recorded mileage: 47,276

Recorded mileage: 47,276


PASS WITH RECTIFICATION


MOT TEST: 18 June 2014 12:26:56 PASSED
MOT TEST: 18 June 2014 12:26:56 PASSED

This test (938329464129) was completed on the 18 June 2014 12:26:56 and PASSED the requirements for a valid MOT with 0 comments.

This test (938329464129) was completed on the 18 June 2014 12:26:56 and PASSED the requirements for a valid MOT with 0 comments.

Recorded mileage: 46,845

Recorded mileage: 46,845


MOT TEST: 03 July 2013 10:12:14 PASSED
MOT TEST: 03 July 2013 10:12:14 PASSED

This test (407264983179) was completed on the 03 July 2013 10:12:14 and PASSED the requirements for a valid MOT with 0 comments.

This test (407264983179) was completed on the 03 July 2013 10:12:14 and PASSED the requirements for a valid MOT with 0 comments.

Recorded mileage: 46,659

Recorded mileage: 46,659


MOT TEST: 02 July 2013 12:30:37 FAILED
MOT TEST: 02 July 2013 12:30:37 FAILED

This test (589263783119) was completed on the 02 July 2013 12:30:37 and FAILED the requirements for a valid MOT with 3 comments.

This test (589263783119) was completed on the 02 July 2013 12:30:37 and FAILED the requirements for a valid MOT with 3 comments.

Recorded mileage: 46,656

Recorded mileage: 46,656


FAIL


MOT TEST: 02 July 2012 12:32:45 PASSED
MOT TEST: 02 July 2012 12:32:45 PASSED

This test (598914982148) was completed on the 02 July 2012 12:32:45 and PASSED the requirements for a valid MOT with 0 comments.

This test (598914982148) was completed on the 02 July 2012 12:32:45 and PASSED the requirements for a valid MOT with 0 comments.

Recorded mileage: 46,305

Recorded mileage: 46,305


MOT TEST: 29 June 2012 11:45:57 FAILED
MOT TEST: 29 June 2012 11:45:57 FAILED

This test (239321082420) was completed on the 29 June 2012 11:45:57 and FAILED the requirements for a valid MOT with 2 comments.

This test (239321082420) was completed on the 29 June 2012 11:45:57 and FAILED the requirements for a valid MOT with 2 comments.

Recorded mileage: 46,285

Recorded mileage: 46,285


FAIL


MOT TEST: 24 June 2011 11:51:21 PASSED
MOT TEST: 24 June 2011 11:51:21 PASSED

This test (257825471456) was completed on the 24 June 2011 11:51:21 and PASSED the requirements for a valid MOT with 4 comments.

This test (257825471456) was completed on the 24 June 2011 11:51:21 and PASSED the requirements for a valid MOT with 4 comments.

Recorded mileage: 45,764

Recorded mileage: 45,764


ADVISORY

USER ENTERED


MOT TEST: 30 June 2010 11:00:22 PASSED
MOT TEST: 30 June 2010 11:00:22 PASSED

This test (413691380148) was completed on the 30 June 2010 11:00:22 and PASSED the requirements for a valid MOT with 0 comments.

This test (413691380148) was completed on the 30 June 2010 11:00:22 and PASSED the requirements for a valid MOT with 0 comments.

Recorded mileage: 44,473

Recorded mileage: 44,473


MOT TEST: 07 July 2009 11:56:27 PASSED
MOT TEST: 07 July 2009 11:56:27 PASSED

This test (860988889192) was completed on the 07 July 2009 11:56:27 and PASSED the requirements for a valid MOT with 0 comments.

This test (860988889192) was completed on the 07 July 2009 11:56:27 and PASSED the requirements for a valid MOT with 0 comments.

Recorded mileage: 43,699

Recorded mileage: 43,699


MOT TEST: 07 July 2008 10:56:32 PASSED
MOT TEST: 07 July 2008 10:56:32 PASSED

This test (363369288174) was completed on the 07 July 2008 10:56:32 and PASSED the requirements for a valid MOT with 0 comments.

This test (363369288174) was completed on the 07 July 2008 10:56:32 and PASSED the requirements for a valid MOT with 0 comments.

Recorded mileage: 42,645

Recorded mileage: 42,645