JAN 742K


JAN742K is registered to a Blue 1971, Morris Minor 1000 with a Petrol engine. It Passed its most recent MOT Test on the 31 July 2018

53 unique faults (63 Total) reported in its MOT History (15 Tests).

8 common/recurring faults, the most frequent (4 times) is: Nearside Rear Stop lamp not working (1.2.1b).

60% (9) MOT Pass Rate and a 40% (6) MOT Failure Rate.

49,943 recorded miles.

JAN 742K


JAN742K is registered to a Blue 1971, Morris Minor 1000 with a Petrol engine. It Passed its most recent MOT Test on the 31 July 2018

53 unique faults (63 Total) reported in its MOT History (15 Tests).

8 common/recurring faults, the most frequent (4 times) is: Nearside Rear Stop lamp not working (1.2.1b).

60% (9) MOT Pass Rate and a 40% (6) MOT Failure Rate.

49,943 recorded miles.

MOT PASS/Failure rate for JAN 742K

all MOT test results for JAN 742K represented as a percentage
MOT PASS/Failure rate for JAN 742K
all MOT test results for JAN 742K represented as a percentage

PERCENTAGE OF VEHICLE FAULTS WITH JAN 742K

ALL REPORTED FAULTS, DISPLAYED BY PERCENTAGE OF OCCURRENCE DURING ALL MOT TESTS
PERCENTAGE OF VEHICLE FAULTS WITH JAN 742K
ALL REPORTED FAULTS, DISPLAYED BY PERCENTAGE OF OCCURRENCE DURING ALL MOT TESTS
ADVISORY

FAIL

USER ENTERED

PASS WITH RECTIFICATION

JAN 742K annual Faults by type

ALL REPORTED FAULTS, DISPLAYED over time and categorised by type
JAN 742K annual Faults by type
ALL REPORTED FAULTS, DISPLAYED over time and categorised by type

RECURRING FAULTS WITH JAN 742K

FAULTS THAT HAVE OCCURED MORE THAN ONCE DURING JAN 742K's MOT HISTORY
RECURRING FAULTS WITH JAN 742K
FAULTS THAT HAVE OCCURED MORE THAN ONCE DURING JAN 742K's MOT HISTORY
Fault Fault Test Date Test Date/Time Reference MOT Test Reference
4 Nearside rear stop lamp not working (1.2.1b) Nearside rear stop lamp not working (1.2.1b) 27 August 2013 [15:40] 27/08/2013 03 August 2009 [21:38] 03/08/2009 01 June 2009 [17:27] 01/06/2009 18 June 2007 [12:53] 18/06/2007 566399233206 566399233206 394195519244 394195519244 894232359191 894232359191 452389267163 452389267163
2 O/s/r shock absorber leaking slightly (abit damp) O/s/r shock absorber leaking slightly (abit damp) 01 July 2011 [17:21] 01/07/2011 28 June 2011 [11:31] 28/06/2011 775562881179 775562881179 528669071178 528669071178
2 Slight corrosion at o/s floor pan edge/sill edge at jacking point area Slight corrosion at o/s floor pan edge/sill edge at jacking point area 01 July 2011 [17:21] 01/07/2011 28 June 2011 [11:31] 28/06/2011 775562881179 775562881179 528669071178 528669071178
2 P/brake efficiency low P/brake efficiency low 01 July 2011 [17:21] 01/07/2011 28 June 2011 [11:31] 28/06/2011 775562881179 775562881179 528669071178 528669071178
2 Indicator stalk slow to flash when operated mainly to the offside Indicator stalk slow to flash when operated mainly to the offside 03 August 2009 [21:38] 03/08/2009 03 August 2009 [21:38] 03/08/2009 720265319209 720265319209 394195519244 394195519244
2 Registration plate lamp not working (1.1.c.1d) Registration plate lamp not working (1.1.c.1d) 03 August 2009 [21:38] 03/08/2009 18 June 2007 [12:53] 18/06/2007 394195519244 394195519244 452389267163 452389267163
2 Horn not working (1.6.2a) Horn not working (1.6.2a) 03 August 2009 [21:38] 03/08/2009 01 June 2009 [17:27] 01/06/2009 394195519244 394195519244 894232359191 894232359191
2 Parking brake: parking brake efficiency only just met. It would appear that the braking system requires adjustment or repair. (3.7.b.7) Parking brake: parking brake efficiency only just met. It would appear that the braking system requires adjustment or repair. (3.7.b.7) 01 June 2009 [17:27] 01/06/2009 18 June 2007 [12:53] 18/06/2007 894232359191 894232359191 452389267163 452389267163

ALL JAN 742K ADVISORIES [16]

ALL ADVISORIES, ORDERED by OCCURRENCE DURING JAN 742K's MOT HISTORY
ALL JAN 742K ADVISORIES [16]
ALL ADVISORIES, ORDERED by OCCURRENCE DURING JAN 742K's MOT HISTORY
Fail Faults | source www.vehiclestats.co.uk
Fault Fault Test Date Test Date/Time Reference MOT Test Reference
2 Parking brake: parking brake efficiency only just met. It would appear that the braking system requires adjustment or repair. (3.7.b.7) Parking brake: parking brake efficiency only just met. It would appear that the braking system requires adjustment or repair. (3.7.b.7) 01 June 2009 [17:27] 01/06/2009 18 June 2007 [12:53] 18/06/2007 894232359191 894232359191 452389267163 452389267163
1 N/s/r tyre getting abit low on tread N/s/r tyre getting abit low on tread 31 July 2018 [15:00] 31/07/2018 584431663422 584431663422
1 Both rear inner w/arches getting corroded at top areas along seams (esp o/s/r, small hole starting, not fail limit at time of test) Both rear inner w/arches getting corroded at top areas along seams (esp o/s/r, small hole starting, not fail limit at time of test) 31 July 2018 [15:00] 31/07/2018 584431663422 584431663422
1 Both rear tyres getting abit low on tread in places Both rear tyres getting abit low on tread in places 28 June 2017 [09:52] 28/06/2017 295274907384 295274907384
1 O/s/r inner w/arch top area along seam, getting abit corroded O/s/r inner w/arch top area along seam, getting abit corroded 28 June 2017 [09:52] 28/06/2017 295274907384 295274907384
1 N/s/f brake binding on slightly N/s/f brake binding on slightly 28 June 2017 [09:52] 28/06/2017 295274907384 295274907384
1 Service brake efficiency getting abit low Service brake efficiency getting abit low 28 June 2017 [09:52] 28/06/2017 295274907384 295274907384
1 Slight surface corrosion at rear end floor pan area underneath spare tyre Slight surface corrosion at rear end floor pan area underneath spare tyre 07 June 2016 [11:58] 07/06/2016 673699211404 673699211404
1 N/s/f chassis area around lower suspension arm mount, getting abit corroded slightly N/s/f chassis area around lower suspension arm mount, getting abit corroded slightly 07 June 2016 [11:58] 07/06/2016 673699211404 673699211404
1 Rear inner w/arch areas abit corroded along seams, in places Rear inner w/arch areas abit corroded along seams, in places 07 June 2016 [11:58] 07/06/2016 673699211404 673699211404
1 Appears to be slight clutch judder when pulling away Appears to be slight clutch judder when pulling away 07 June 2016 [11:58] 07/06/2016 673699211404 673699211404
1 Nearside front brake fluctuating, but not excessively (3.7.b.3) Nearside front brake fluctuating, but not excessively (3.7.b.3) 19 September 2013 [11:47] 19/09/2013 639712563262 639712563262
1 Nearside front front wheel bearing has slight play (2.5.a.3c) Nearside front front wheel bearing has slight play (2.5.a.3c) 01 June 2009 [17:27] 01/06/2009 894232359191 894232359191
1 Body has slight corrosion (6.1.b.2) Body has slight corrosion (6.1.b.2) 23 June 2007 [18:10] 23/06/2007 282844877459 282844877459
1 Service brake: service brake efficiency only just met. It would appear that the braking system requires adjustment or repair. (3.7.b.7) Service brake: service brake efficiency only just met. It would appear that the braking system requires adjustment or repair. (3.7.b.7) 18 June 2007 [12:53] 18/06/2007 452389267163 452389267163

ALL JAN 742K Failure Faults [19]

ALL Failure faults, ORDERED by OCCURRENCE DURING JAN 742K's MOT HISTORY
ALL JAN 742K Failure Faults [19]
ALL Failure faults, ORDERED by OCCURRENCE DURING JAN 742K's MOT HISTORY
Fail Faults | source www.vehiclestats.co.uk
Fault Fault Test Date Test Date/Time Reference MOT Test Reference
2 Nearside rear stop lamp not working (1.2.1b) Nearside rear stop lamp not working (1.2.1b) 27 August 2013 [15:40] 27/08/2013 01 June 2009 [17:27] 01/06/2009 566399233206 566399233206 894232359191 894232359191
1 Offside rear stop lamp not working (1.2.1b) Offside rear stop lamp not working (1.2.1b) 27 August 2013 [15:40] 27/08/2013 566399233206 566399233206
1 Direction indicators not working (1.4.a.2c) Direction indicators not working (1.4.a.2c) 27 August 2013 [15:40] 27/08/2013 566399233206 566399233206
1 Nearside front headlamp not working on dipped beam (1.7.5a) Nearside front headlamp not working on dipped beam (1.7.5a) 27 August 2013 [15:40] 27/08/2013 566399233206 566399233206
1 Nearside front headlamp not working on main beam (1.7.5a) Nearside front headlamp not working on main beam (1.7.5a) 27 August 2013 [15:40] 27/08/2013 566399233206 566399233206
1 Front windscreen wiper does not clear the windscreen effectively (8.2.2) Front windscreen wiper does not clear the windscreen effectively (8.2.2) 27 August 2013 [15:40] 27/08/2013 566399233206 566399233206
1 Nearside front windscreen wiper does not clear the windscreen effectively (8.2.2) Nearside front windscreen wiper does not clear the windscreen effectively (8.2.2) 27 August 2013 [15:40] 27/08/2013 566399233206 566399233206
1 Offside front windscreen wiper does not clear the windscreen effectively (8.2.2) Offside front windscreen wiper does not clear the windscreen effectively (8.2.2) 27 August 2013 [15:40] 27/08/2013 566399233206 566399233206
1 Rear exhaust system not adequately supported (7.1.1) Rear exhaust system not adequately supported (7.1.1) 27 August 2013 [15:40] 27/08/2013 566399233206 566399233206
1 Brake pedal does not operate a brake fitted to each wheel (3.3.a.3) Brake pedal does not operate a brake fitted to each wheel (3.3.a.3) 27 August 2013 [15:40] 27/08/2013 566399233206 566399233206
1 Service brake: efficiency below requirements (3.7.d.4) Service brake: efficiency below requirements (3.7.d.4) 27 August 2013 [15:40] 27/08/2013 566399233206 566399233206
1 Nearside rear rear brake recording little or no effort (3.7.b.5a) Nearside rear rear brake recording little or no effort (3.7.b.5a) 28 June 2011 [11:31] 28/06/2011 528669071178 528669071178
1 Nearside parking brake recording little or no effort (3.7.d.3a) Nearside parking brake recording little or no effort (3.7.d.3a) 28 June 2011 [11:31] 28/06/2011 528669071178 528669071178
1 Rear brakes release unevenly (3.7.b.4) Rear brakes release unevenly (3.7.b.4) 01 June 2009 [17:27] 01/06/2009 894232359191 894232359191
1 Horn not working (1.6.2a) Horn not working (1.6.2a) 01 June 2009 [17:27] 01/06/2009 894232359191 894232359191
1 Offside front headlamp not working on main beam (1.7.5a) Offside front headlamp not working on main beam (1.7.5a) 01 June 2009 [17:27] 01/06/2009 894232359191 894232359191
1 Brakes imbalanced across an axle (3.7.b.5b) Brakes imbalanced across an axle (3.7.b.5b) 18 June 2007 [12:53] 18/06/2007 452389267163 452389267163
1 Nearside windscreen wiper blade insecure (8.2.2) Nearside windscreen wiper blade insecure (8.2.2) 18 June 2007 [12:53] 18/06/2007 452389267163 452389267163

ALL JAN 742K User Entered Faults [19]

ALL User Entered faults, ORDERED by OCCURRENCE DURING JAN 742K's MOT HISTORY
ALL JAN 742K User Entered Faults [19]
ALL User Entered faults, ORDERED by OCCURRENCE DURING JAN 742K's MOT HISTORY
User Entered Faults | source www.vehiclestats.co.uk
Fault Fault Test Date Test Date/Time Reference MOT Test Reference
2 O/s/r shock absorber leaking slightly (abit damp) O/s/r shock absorber leaking slightly (abit damp) 01 July 2011 [17:21] 01/07/2011 28 June 2011 [11:31] 28/06/2011 775562881179 775562881179 528669071178 528669071178
2 Slight corrosion at o/s floor pan edge/sill edge at jacking point area Slight corrosion at o/s floor pan edge/sill edge at jacking point area 01 July 2011 [17:21] 01/07/2011 28 June 2011 [11:31] 28/06/2011 775562881179 775562881179 528669071178 528669071178
2 P/brake efficiency low P/brake efficiency low 01 July 2011 [17:21] 01/07/2011 28 June 2011 [11:31] 28/06/2011 775562881179 775562881179 528669071178 528669071178
2 Indicator stalk slow to flash when operated mainly to the offside Indicator stalk slow to flash when operated mainly to the offside 03 August 2009 [21:38] 03/08/2009 03 August 2009 [21:38] 03/08/2009 720265319209 720265319209 394195519244 394195519244
1 Brake pedal has excessive travel. The travel occurs intermittantly. Brake pedal has excessive travel. The travel occurs intermittantly. 27 August 2013 [15:40] 27/08/2013 566399233206 566399233206
1 N/s/f chassis area around susp/arm mount getting abit corroded N/s/f chassis area around susp/arm mount getting abit corroded 24 August 2012 [13:22] 24/08/2012 117657932241 117657932241
1 Rear end exhaust rubber mount broken off (pipe not insecure at time of test) Rear end exhaust rubber mount broken off (pipe not insecure at time of test) 24 August 2012 [13:22] 24/08/2012 117657932241 117657932241
1 Both rear inner w/arch areas along outer wing fixing seams, getting abit corroded in places Both rear inner w/arch areas along outer wing fixing seams, getting abit corroded in places 24 August 2012 [13:22] 24/08/2012 117657932241 117657932241
1 Oil leak Oil leak 01 June 2009 [17:27] 01/06/2009 894232359191 894232359191
1 Battery insecure Battery insecure 01 June 2009 [17:27] 01/06/2009 894232359191 894232359191
1 Exhaust hitting chassis Exhaust hitting chassis 01 June 2009 [17:27] 01/06/2009 894232359191 894232359191
1 Misfire on engine when revved Misfire on engine when revved 01 June 2009 [17:27] 01/06/2009 894232359191 894232359191
1 Nearside rear brake slightly binding Nearside rear brake slightly binding 01 June 2009 [17:27] 01/06/2009 894232359191 894232359191
1 Wing mirrors glass detteriated both sides Wing mirrors glass detteriated both sides 01 June 2009 [17:27] 01/06/2009 894232359191 894232359191
1 Indicators slow to flash when first tested Indicators slow to flash when first tested 01 June 2009 [17:27] 01/06/2009 894232359191 894232359191

ALL JAN 742K Pass With Rectification Faults [9]

ALL Pass With Rectification faults, ORDERED by OCCURRENCE DURING JAN 742K's MOT HISTORY
ALL JAN 742K Pass With Rectification Faults [9]
ALL Pass With Rectification faults, ORDERED by OCCURRENCE DURING JAN 742K's MOT HISTORY
Pass With Rectification Faults | source www.vehiclestats.co.uk
Fault Fault Test Date Test Date/Time Reference MOT Test Reference
2 Registration plate lamp not working (1.1.c.1d) Registration plate lamp not working (1.1.c.1d) 03 August 2009 [21:38] 03/08/2009 18 June 2007 [12:53] 18/06/2007 394195519244 394195519244 452389267163 452389267163
2 Nearside rear stop lamp not working (1.2.1b) Nearside rear stop lamp not working (1.2.1b) 03 August 2009 [21:38] 03/08/2009 18 June 2007 [12:53] 18/06/2007 394195519244 394195519244 452389267163 452389267163
1 Offside front direction indicator not working (1.4.a.2c) Offside front direction indicator not working (1.4.a.2c) 27 August 2014 [15:58] 27/08/2014 969199434208 969199434208
1 Nearside rear rear brake binding (3.7.b.1) Nearside rear rear brake binding (3.7.b.1) 03 August 2009 [21:38] 03/08/2009 394195519244 394195519244
1 Brake hydraulic reservoir fluid level below minimum level (3.6.g.1b) Brake hydraulic reservoir fluid level below minimum level (3.6.g.1b) 03 August 2009 [21:38] 03/08/2009 394195519244 394195519244
1 Horn not working (1.6.2a) Horn not working (1.6.2a) 03 August 2009 [21:38] 03/08/2009 394195519244 394195519244
1 Front windscreen wiper not operating automatically when switched on (8.2.1b) Front windscreen wiper not operating automatically when switched on (8.2.1b) 18 June 2007 [12:53] 18/06/2007 452389267163 452389267163

MOT TEST: 31 July 2018 15:00:44 PASSED
MOT TEST: 31 July 2018 15:00:44 PASSED

This test (584431663422) was completed on the 31 July 2018 15:00:44 and PASSED the requirements for a valid MOT with 2 comments.

This test (584431663422) was completed on the 31 July 2018 15:00:44 and PASSED the requirements for a valid MOT with 2 comments.

Recorded mileage: 49,943

Recorded mileage: 49,943


ADVISORY


MOT TEST: 28 June 2017 09:52:31 PASSED
MOT TEST: 28 June 2017 09:52:31 PASSED

This test (295274907384) was completed on the 28 June 2017 09:52:31 and PASSED the requirements for a valid MOT with 4 comments.

This test (295274907384) was completed on the 28 June 2017 09:52:31 and PASSED the requirements for a valid MOT with 4 comments.

Recorded mileage: 49,822

Recorded mileage: 49,822


ADVISORY


MOT TEST: 07 June 2016 11:58:08 PASSED
MOT TEST: 07 June 2016 11:58:08 PASSED

This test (673699211404) was completed on the 07 June 2016 11:58:08 and PASSED the requirements for a valid MOT with 4 comments.

This test (673699211404) was completed on the 07 June 2016 11:58:08 and PASSED the requirements for a valid MOT with 4 comments.

Recorded mileage: 49,680

Recorded mileage: 49,680


ADVISORY


MOT TEST: 27 August 2014 15:58:39 PASSED
MOT TEST: 27 August 2014 15:58:39 PASSED

This test (646839534248) was completed on the 27 August 2014 15:58:39 and PASSED the requirements for a valid MOT with 0 comments.

This test (646839534248) was completed on the 27 August 2014 15:58:39 and PASSED the requirements for a valid MOT with 0 comments.

Recorded mileage: 49,511

Recorded mileage: 49,511


MOT TEST: 27 August 2014 15:58:39 FAILED
MOT TEST: 27 August 2014 15:58:39 FAILED

This test (969199434208) was completed on the 27 August 2014 15:58:39 and FAILED the requirements for a valid MOT with 1 comments.

This test (969199434208) was completed on the 27 August 2014 15:58:39 and FAILED the requirements for a valid MOT with 1 comments.

Recorded mileage: 49,511

Recorded mileage: 49,511


PASS WITH RECTIFICATION


MOT TEST: 19 September 2013 11:47:23 PASSED
MOT TEST: 19 September 2013 11:47:23 PASSED

This test (639712563262) was completed on the 19 September 2013 11:47:23 and PASSED the requirements for a valid MOT with 1 comments.

This test (639712563262) was completed on the 19 September 2013 11:47:23 and PASSED the requirements for a valid MOT with 1 comments.

Recorded mileage: 49,449

Recorded mileage: 49,449


ADVISORY


MOT TEST: 27 August 2013 15:40:31 FAILED
MOT TEST: 27 August 2013 15:40:31 FAILED

This test (566399233206) was completed on the 27 August 2013 15:40:31 and FAILED the requirements for a valid MOT with 12 comments.

This test (566399233206) was completed on the 27 August 2013 15:40:31 and FAILED the requirements for a valid MOT with 12 comments.

Recorded mileage: 49,446

Recorded mileage: 49,446


FAIL

USER ENTERED


MOT TEST: 24 August 2012 13:22:42 PASSED
MOT TEST: 24 August 2012 13:22:42 PASSED

This test (117657932241) was completed on the 24 August 2012 13:22:42 and PASSED the requirements for a valid MOT with 3 comments.

This test (117657932241) was completed on the 24 August 2012 13:22:42 and PASSED the requirements for a valid MOT with 3 comments.

Recorded mileage: 49,327

Recorded mileage: 49,327


USER ENTERED


MOT TEST: 01 July 2011 17:21:25 PASSED
MOT TEST: 01 July 2011 17:21:25 PASSED

This test (775562881179) was completed on the 01 July 2011 17:21:25 and PASSED the requirements for a valid MOT with 3 comments.

This test (775562881179) was completed on the 01 July 2011 17:21:25 and PASSED the requirements for a valid MOT with 3 comments.

Recorded mileage: 49,222

Recorded mileage: 49,222


USER ENTERED


MOT TEST: 28 June 2011 11:31:28 FAILED
MOT TEST: 28 June 2011 11:31:28 FAILED

This test (528669071178) was completed on the 28 June 2011 11:31:28 and FAILED the requirements for a valid MOT with 5 comments.

This test (528669071178) was completed on the 28 June 2011 11:31:28 and FAILED the requirements for a valid MOT with 5 comments.

Recorded mileage: 49,221

Recorded mileage: 49,221


FAIL

USER ENTERED


MOT TEST: 03 August 2009 21:38:39 PASSED
MOT TEST: 03 August 2009 21:38:39 PASSED

This test (720265319209) was completed on the 03 August 2009 21:38:39 and PASSED the requirements for a valid MOT with 1 comments.

This test (720265319209) was completed on the 03 August 2009 21:38:39 and PASSED the requirements for a valid MOT with 1 comments.

Recorded mileage: 49,094

Recorded mileage: 49,094


USER ENTERED


MOT TEST: 03 August 2009 21:38:39 FAILED
MOT TEST: 03 August 2009 21:38:39 FAILED

This test (394195519244) was completed on the 03 August 2009 21:38:39 and FAILED the requirements for a valid MOT with 6 comments.

This test (394195519244) was completed on the 03 August 2009 21:38:39 and FAILED the requirements for a valid MOT with 6 comments.

Recorded mileage: 49,094

Recorded mileage: 49,094


USER ENTERED

PASS WITH RECTIFICATION


MOT TEST: 01 June 2009 17:27:41 FAILED
MOT TEST: 01 June 2009 17:27:41 FAILED

This test (894232359191) was completed on the 01 June 2009 17:27:41 and FAILED the requirements for a valid MOT with 13 comments.

This test (894232359191) was completed on the 01 June 2009 17:27:41 and FAILED the requirements for a valid MOT with 13 comments.

Recorded mileage: 49,092

Recorded mileage: 49,092


ADVISORY

FAIL

USER ENTERED


MOT TEST: 23 June 2007 18:10:33 PASSED
MOT TEST: 23 June 2007 18:10:33 PASSED

This test (282844877459) was completed on the 23 June 2007 18:10:33 and PASSED the requirements for a valid MOT with 1 comments.

This test (282844877459) was completed on the 23 June 2007 18:10:33 and PASSED the requirements for a valid MOT with 1 comments.

Recorded mileage: 48,919

Recorded mileage: 48,919


ADVISORY


MOT TEST: 18 June 2007 12:53:16 FAILED
MOT TEST: 18 June 2007 12:53:16 FAILED

This test (452389267163) was completed on the 18 June 2007 12:53:16 and FAILED the requirements for a valid MOT with 7 comments.

This test (452389267163) was completed on the 18 June 2007 12:53:16 and FAILED the requirements for a valid MOT with 7 comments.

Recorded mileage: 48,919

Recorded mileage: 48,919


ADVISORY

FAIL

PASS WITH RECTIFICATION