JAS 920


JAS920 is registered to a Black 1957, Morris Minor with a Petrol engine. It Failed its most recent MOT Test on the 13 December 2011

11 unique faults (11 Total) reported in its MOT History (2 Tests).

0 common/recurring faults.

50% (1) MOT Pass Rate and a 50% (1) MOT Failure Rate.

5,772 recorded miles.

JAS 920


JAS920 is registered to a Black 1957, Morris Minor with a Petrol engine. It Failed its most recent MOT Test on the 13 December 2011

11 unique faults (11 Total) reported in its MOT History (2 Tests).

0 common/recurring faults.

50% (1) MOT Pass Rate and a 50% (1) MOT Failure Rate.

5,772 recorded miles.

MOT PASS/Failure rate for JAS 920

all MOT test results for JAS 920 represented as a percentage
MOT PASS/Failure rate for JAS 920
all MOT test results for JAS 920 represented as a percentage

PERCENTAGE OF VEHICLE FAULTS WITH JAS 920

ALL REPORTED FAULTS, DISPLAYED BY PERCENTAGE OF OCCURRENCE DURING ALL MOT TESTS
PERCENTAGE OF VEHICLE FAULTS WITH JAS 920
ALL REPORTED FAULTS, DISPLAYED BY PERCENTAGE OF OCCURRENCE DURING ALL MOT TESTS
FAIL

JAS 920 annual Faults by type

ALL REPORTED FAULTS, DISPLAYED over time and categorised by type
JAS 920 annual Faults by type
ALL REPORTED FAULTS, DISPLAYED over time and categorised by type

ALL JAS 920 Failure Faults [11]

ALL Failure faults, ORDERED by OCCURRENCE DURING JAS 920's MOT HISTORY
ALL JAS 920 Failure Faults [11]
ALL Failure faults, ORDERED by OCCURRENCE DURING JAS 920's MOT HISTORY
Fail Faults | source www.vehiclestats.co.uk
Fault Fault Test Date Test Date/Time Reference MOT Test Reference
1 Nearside front direction indicators not working (1.4.a.2c) Nearside front direction indicators not working (1.4.a.2c) 05 December 2011 [12:42] 05/12/2011 148179131315 148179131315
1 Offside front direction indicators not working (1.4.a.2c) Offside front direction indicators not working (1.4.a.2c) 05 December 2011 [12:42] 05/12/2011 148179131315 148179131315
1 Nearside rear direction indicators not working (1.4.a.2c) Nearside rear direction indicators not working (1.4.a.2c) 05 December 2011 [12:42] 05/12/2011 148179131315 148179131315
1 Offside rear direction indicators not working (1.4.a.2c) Offside rear direction indicators not working (1.4.a.2c) 05 December 2011 [12:42] 05/12/2011 148179131315 148179131315
1 Indicator switch faulty (1.4.a.1) Indicator switch faulty (1.4.a.1) 05 December 2011 [12:42] 05/12/2011 148179131315 148179131315
1 Nearside front tyre has ply or cords exposed (4.1.d.1b) Nearside front tyre has ply or cords exposed (4.1.d.1b) 05 December 2011 [12:42] 05/12/2011 148179131315 148179131315
1 Offside front tyre has ply or cords exposed (4.1.d.1b) Offside front tyre has ply or cords exposed (4.1.d.1b) 05 December 2011 [12:42] 05/12/2011 148179131315 148179131315
1 Nearside rear tyre has ply or cords exposed (4.1.d.1b) Nearside rear tyre has ply or cords exposed (4.1.d.1b) 05 December 2011 [12:42] 05/12/2011 148179131315 148179131315
1 Nearside rear fuel cap/sealing device does not fasten securely maintaining the sealing arrangement (7.2.4b) Nearside rear fuel cap/sealing device does not fasten securely maintaining the sealing arrangement (7.2.4b) 05 December 2011 [12:42] 05/12/2011 148179131315 148179131315
1 Offside front headlamp aim too high (1.8) Offside front headlamp aim too high (1.8) 05 December 2011 [12:42] 05/12/2011 148179131315 148179131315
1 Front windscreen wiper does not clear the windscreen effectively (8.2.2) Front windscreen wiper does not clear the windscreen effectively (8.2.2) 05 December 2011 [12:42] 05/12/2011 148179131315 148179131315

MOT TEST: 13 December 2011 13:44:38 PASSED
MOT TEST: 13 December 2011 13:44:38 PASSED

This test (489797741394) was completed on the 13 December 2011 13:44:38 and PASSED the requirements for a valid MOT with 0 comments.

This test (489797741394) was completed on the 13 December 2011 13:44:38 and PASSED the requirements for a valid MOT with 0 comments.

Recorded mileage: 5,772

Recorded mileage: 5,772


MOT TEST: 05 December 2011 12:42:50 FAILED
MOT TEST: 05 December 2011 12:42:50 FAILED

This test (148179131315) was completed on the 05 December 2011 12:42:50 and FAILED the requirements for a valid MOT with 11 comments.

This test (148179131315) was completed on the 05 December 2011 12:42:50 and FAILED the requirements for a valid MOT with 11 comments.

Recorded mileage: 5,771

Recorded mileage: 5,771


FAIL