JAT 707D


JAT707D is registered to a Grey 1966, Morris Minor with a Petrol engine. It Failed its most recent MOT Test on the 04 July 2017

12 unique faults (13 Total) reported in its MOT History (12 Tests).

1 common/recurring faults.

67% (8) MOT Pass Rate and a 33% (4) MOT Failure Rate.

46,836 recorded miles.

JAT 707D


JAT707D is registered to a Grey 1966, Morris Minor with a Petrol engine. It Failed its most recent MOT Test on the 04 July 2017

12 unique faults (13 Total) reported in its MOT History (12 Tests).

1 common/recurring faults.

67% (8) MOT Pass Rate and a 33% (4) MOT Failure Rate.

46,836 recorded miles.

MOT PASS/Failure rate for JAT 707D

all MOT test results for JAT 707D represented as a percentage
MOT PASS/Failure rate for JAT 707D
all MOT test results for JAT 707D represented as a percentage

PERCENTAGE OF VEHICLE FAULTS WITH JAT 707D

ALL REPORTED FAULTS, DISPLAYED BY PERCENTAGE OF OCCURRENCE DURING ALL MOT TESTS
PERCENTAGE OF VEHICLE FAULTS WITH JAT 707D
ALL REPORTED FAULTS, DISPLAYED BY PERCENTAGE OF OCCURRENCE DURING ALL MOT TESTS
ADVISORY

FAIL

PASS WITH RECTIFICATION

JAT 707D annual Faults by type

ALL REPORTED FAULTS, DISPLAYED over time and categorised by type
JAT 707D annual Faults by type
ALL REPORTED FAULTS, DISPLAYED over time and categorised by type

ALL JAT 707D ADVISORIES [1]

ALL ADVISORIES, ORDERED by OCCURRENCE DURING JAT 707D's MOT HISTORY
ALL JAT 707D ADVISORIES [1]
ALL ADVISORIES, ORDERED by OCCURRENCE DURING JAT 707D's MOT HISTORY
Fail Faults | source www.vehiclestats.co.uk
Fault Fault Test Date Test Date/Time Reference MOT Test Reference
1 Diff oil leak Diff oil leak 26 July 2016 [09:44] 26/07/2016 243267599993 243267599993

ALL JAT 707D Failure Faults [11]

ALL Failure faults, ORDERED by OCCURRENCE DURING JAT 707D's MOT HISTORY
ALL JAT 707D Failure Faults [11]
ALL Failure faults, ORDERED by OCCURRENCE DURING JAT 707D's MOT HISTORY
Fail Faults | source www.vehiclestats.co.uk
Fault Fault Test Date Test Date/Time Reference MOT Test Reference
2 Horn not working (1.6.2a) Horn not working (1.6.2a) 26 July 2016 [09:44] 26/07/2016 26 July 2013 [15:40] 26/07/2013 243267599993 243267599993 406467603219 406467603219
1 Service brake: efficiency below requirements (3.7.b.7) Service brake: efficiency below requirements (3.7.b.7) 26 July 2016 [09:44] 26/07/2016 243267599993 243267599993
1 Front brakes imbalanced across an axle (3.7.b.5b) Front brakes imbalanced across an axle (3.7.b.5b) 26 July 2016 [09:44] 26/07/2016 243267599993 243267599993
1 Offside front position lamp(s) not working (1.1.a.3b) Offside front position lamp(s) not working (1.1.a.3b) 26 July 2016 [09:44] 26/07/2016 243267599993 243267599993
1 Windscreen washer provides insufficient washer liquid (8.2.3) Windscreen washer provides insufficient washer liquid (8.2.3) 26 July 2016 [09:44] 26/07/2016 243267599993 243267599993
1 Nearside front front brake recording little or no effort (3.7.b.5a) Nearside front front brake recording little or no effort (3.7.b.5a) 26 July 2016 [09:44] 26/07/2016 243267599993 243267599993
1 Nearside rear wheel cylinder leaking (3.6.a.1) Nearside rear wheel cylinder leaking (3.6.a.1) 18 September 2009 [14:49] 18/09/2009 861101069259 861101069259
1 Brake performance not tested (3.7.a.1) Brake performance not tested (3.7.a.1) 18 September 2009 [14:49] 18/09/2009 861101069259 861101069259
1 Service brake: efficiency below requirements (3.7.c.1a) Service brake: efficiency below requirements (3.7.c.1a) 18 September 2009 [14:49] 18/09/2009 861101069259 861101069259
1 Parking brake: efficiency below requirements (3.7.c.1b) Parking brake: efficiency below requirements (3.7.c.1b) 18 September 2009 [14:49] 18/09/2009 861101069259 861101069259

ALL JAT 707D Pass With Rectification Faults [1]

ALL Pass With Rectification faults, ORDERED by OCCURRENCE DURING JAT 707D's MOT HISTORY
ALL JAT 707D Pass With Rectification Faults [1]
ALL Pass With Rectification faults, ORDERED by OCCURRENCE DURING JAT 707D's MOT HISTORY
Pass With Rectification Faults | source www.vehiclestats.co.uk
Fault Fault Test Date Test Date/Time Reference MOT Test Reference
1 Nearside front position lamp(s) not working (1.1.a.3b) Nearside front position lamp(s) not working (1.1.a.3b) 04 July 2017 [15:01] 04/07/2017 313399641414 313399641414

MOT TEST: 04 July 2017 15:01:24 PASSED
MOT TEST: 04 July 2017 15:01:24 PASSED

This test (206640720317) was completed on the 04 July 2017 15:01:24 and PASSED the requirements for a valid MOT with 0 comments.

This test (206640720317) was completed on the 04 July 2017 15:01:24 and PASSED the requirements for a valid MOT with 0 comments.

Recorded mileage: 46,836

Recorded mileage: 46,836


MOT TEST: 04 July 2017 15:01:23 FAILED
MOT TEST: 04 July 2017 15:01:23 FAILED

This test (313399641414) was completed on the 04 July 2017 15:01:23 and FAILED the requirements for a valid MOT with 1 comments.

This test (313399641414) was completed on the 04 July 2017 15:01:23 and FAILED the requirements for a valid MOT with 1 comments.

Recorded mileage: 46,836

Recorded mileage: 46,836


PASS WITH RECTIFICATION


MOT TEST: 01 August 2016 15:53:39 PASSED
MOT TEST: 01 August 2016 15:53:39 PASSED

This test (566305611607) was completed on the 01 August 2016 15:53:39 and PASSED the requirements for a valid MOT with 0 comments.

This test (566305611607) was completed on the 01 August 2016 15:53:39 and PASSED the requirements for a valid MOT with 0 comments.

Recorded mileage: 46,748

Recorded mileage: 46,748


MOT TEST: 26 July 2016 09:44:42 FAILED
MOT TEST: 26 July 2016 09:44:42 FAILED

This test (243267599993) was completed on the 26 July 2016 09:44:42 and FAILED the requirements for a valid MOT with 7 comments.

This test (243267599993) was completed on the 26 July 2016 09:44:42 and FAILED the requirements for a valid MOT with 7 comments.

Recorded mileage: 46,748

Recorded mileage: 46,748


ADVISORY

FAIL


MOT TEST: 27 June 2015 10:14:49 PASSED
MOT TEST: 27 June 2015 10:14:49 PASSED

This test (447578675122) was completed on the 27 June 2015 10:14:49 and PASSED the requirements for a valid MOT with 0 comments.

This test (447578675122) was completed on the 27 June 2015 10:14:49 and PASSED the requirements for a valid MOT with 0 comments.

Recorded mileage: 46,636

Recorded mileage: 46,636


MOT TEST: 28 June 2014 12:23:22 PASSED
MOT TEST: 28 June 2014 12:23:22 PASSED

This test (295049374469) was completed on the 28 June 2014 12:23:22 and PASSED the requirements for a valid MOT with 0 comments.

This test (295049374469) was completed on the 28 June 2014 12:23:22 and PASSED the requirements for a valid MOT with 0 comments.

Recorded mileage: 46,530

Recorded mileage: 46,530


MOT TEST: 26 July 2013 16:55:22 PASSED
MOT TEST: 26 July 2013 16:55:22 PASSED

This test (106717503291) was completed on the 26 July 2013 16:55:22 and PASSED the requirements for a valid MOT with 0 comments.

This test (106717503291) was completed on the 26 July 2013 16:55:22 and PASSED the requirements for a valid MOT with 0 comments.

Recorded mileage: 46,516

Recorded mileage: 46,516


MOT TEST: 26 July 2013 15:40:23 FAILED
MOT TEST: 26 July 2013 15:40:23 FAILED

This test (406467603219) was completed on the 26 July 2013 15:40:23 and FAILED the requirements for a valid MOT with 1 comments.

This test (406467603219) was completed on the 26 July 2013 15:40:23 and FAILED the requirements for a valid MOT with 1 comments.

Recorded mileage: 46,516

Recorded mileage: 46,516


FAIL


MOT TEST: 14 July 2012 10:27:09 PASSED
MOT TEST: 14 July 2012 10:27:09 PASSED

This test (575416392163) was completed on the 14 July 2012 10:27:09 and PASSED the requirements for a valid MOT with 0 comments.

This test (575416392163) was completed on the 14 July 2012 10:27:09 and PASSED the requirements for a valid MOT with 0 comments.

Recorded mileage: 46,444

Recorded mileage: 46,444


MOT TEST: 11 June 2011 11:01:50 PASSED
MOT TEST: 11 June 2011 11:01:50 PASSED

This test (337772161186) was completed on the 11 June 2011 11:01:50 and PASSED the requirements for a valid MOT with 0 comments.

This test (337772161186) was completed on the 11 June 2011 11:01:50 and PASSED the requirements for a valid MOT with 0 comments.

Recorded mileage: 46,290

Recorded mileage: 46,290


MOT TEST: 19 September 2009 12:03:00 PASSED
MOT TEST: 19 September 2009 12:03:00 PASSED

This test (401082869202) was completed on the 19 September 2009 12:03:00 and PASSED the requirements for a valid MOT with 0 comments.

This test (401082869202) was completed on the 19 September 2009 12:03:00 and PASSED the requirements for a valid MOT with 0 comments.

Recorded mileage: 45,870

Recorded mileage: 45,870


MOT TEST: 18 September 2009 14:49:57 FAILED
MOT TEST: 18 September 2009 14:49:57 FAILED

This test (861101069259) was completed on the 18 September 2009 14:49:57 and FAILED the requirements for a valid MOT with 4 comments.

This test (861101069259) was completed on the 18 September 2009 14:49:57 and FAILED the requirements for a valid MOT with 4 comments.

Recorded mileage: 45,870

Recorded mileage: 45,870


FAIL