JAW 97E


JAW97E is registered to a Black 1967, Morris Minor 1000 with a Petrol engine. It Failed its most recent MOT Test on the 30 May 2017

8 unique faults (8 Total) reported in its MOT History (10 Tests).

0 common/recurring faults.

80% (8) MOT Pass Rate and a 20% (2) MOT Failure Rate.

16,700 recorded miles.

JAW 97E


JAW97E is registered to a Black 1967, Morris Minor 1000 with a Petrol engine. It Failed its most recent MOT Test on the 30 May 2017

8 unique faults (8 Total) reported in its MOT History (10 Tests).

0 common/recurring faults.

80% (8) MOT Pass Rate and a 20% (2) MOT Failure Rate.

16,700 recorded miles.

MOT PASS/Failure rate for JAW 97E

all MOT test results for JAW 97E represented as a percentage
MOT PASS/Failure rate for JAW 97E
all MOT test results for JAW 97E represented as a percentage

PERCENTAGE OF VEHICLE FAULTS WITH JAW 97E

ALL REPORTED FAULTS, DISPLAYED BY PERCENTAGE OF OCCURRENCE DURING ALL MOT TESTS
PERCENTAGE OF VEHICLE FAULTS WITH JAW 97E
ALL REPORTED FAULTS, DISPLAYED BY PERCENTAGE OF OCCURRENCE DURING ALL MOT TESTS
ADVISORY

FAIL

PASS WITH RECTIFICATION

JAW 97E annual Faults by type

ALL REPORTED FAULTS, DISPLAYED over time and categorised by type
JAW 97E annual Faults by type
ALL REPORTED FAULTS, DISPLAYED over time and categorised by type

ALL JAW 97E ADVISORIES [1]

ALL ADVISORIES, ORDERED by OCCURRENCE DURING JAW 97E's MOT HISTORY
ALL JAW 97E ADVISORIES [1]
ALL ADVISORIES, ORDERED by OCCURRENCE DURING JAW 97E's MOT HISTORY
Advisory Faults | source www.vehiclestats.co.uk
Fault Fault Test Date Test Date/Time Reference MOT Test Reference
1 Nearside front vehicle structure has slight corrosion (6.1.a.1) Nearside front vehicle structure has slight corrosion (6.1.a.1) 13 May 2016 [08:55] 13/05/2016 367772316688 367772316688

ALL JAW 97E Failure Faults [6]

ALL Failure faults, ORDERED by OCCURRENCE DURING JAW 97E's MOT HISTORY
ALL JAW 97E Failure Faults [6]
ALL Failure faults, ORDERED by OCCURRENCE DURING JAW 97E's MOT HISTORY
Fail Faults | source www.vehiclestats.co.uk
Fault Fault Test Date Test Date/Time Reference MOT Test Reference
1 Service brake: efficiency below requirements (3.7.c.1a) Service brake: efficiency below requirements (3.7.c.1a) 11 May 2016 [15:57] 11/05/2016 126382320201 126382320201
1 Parking brake: efficiency below requirements (3.7.c.1b) Parking brake: efficiency below requirements (3.7.c.1b) 11 May 2016 [15:57] 11/05/2016 126382320201 126382320201
1 Rear brake excessively fluctuating (3.7.b.3) Rear brake excessively fluctuating (3.7.b.3) 11 May 2016 [15:57] 11/05/2016 126382320201 126382320201
1 Rear parking brake recording little or no effort (3.7.b.6a) Rear parking brake recording little or no effort (3.7.b.6a) 11 May 2016 [15:57] 11/05/2016 126382320201 126382320201
1 Nearside rear rear brake binding (3.7.b.1) Nearside rear rear brake binding (3.7.b.1) 11 May 2016 [15:57] 11/05/2016 126382320201 126382320201
1 Front exhaust has a major leak of exhaust gases (7.1.2) Front exhaust has a major leak of exhaust gases (7.1.2) 11 May 2016 [15:57] 11/05/2016 126382320201 126382320201

ALL JAW 97E Pass With Rectification Faults [1]

ALL Pass With Rectification faults, ORDERED by OCCURRENCE DURING JAW 97E's MOT HISTORY
ALL JAW 97E Pass With Rectification Faults [1]
ALL Pass With Rectification faults, ORDERED by OCCURRENCE DURING JAW 97E's MOT HISTORY
Pass With Rectification Faults | source www.vehiclestats.co.uk
Fault Fault Test Date Test Date/Time Reference MOT Test Reference
1 Exhaust system not adequately supported repair rear mounting (7.1.1) Exhaust system not adequately supported repair rear mounting (7.1.1) 30 May 2017 [08:30] 30/05/2017 789401764417 789401764417

MOT TEST: 30 May 2017 08:30:53 PASSED
MOT TEST: 30 May 2017 08:30:53 PASSED

This test (879283115624) was completed on the 30 May 2017 08:30:53 and PASSED the requirements for a valid MOT with 0 comments.

This test (879283115624) was completed on the 30 May 2017 08:30:53 and PASSED the requirements for a valid MOT with 0 comments.

Recorded mileage: 16,700

Recorded mileage: 16,700


MOT TEST: 30 May 2017 08:30:52 FAILED
MOT TEST: 30 May 2017 08:30:52 FAILED

This test (789401764417) was completed on the 30 May 2017 08:30:52 and FAILED the requirements for a valid MOT with 1 comments.

This test (789401764417) was completed on the 30 May 2017 08:30:52 and FAILED the requirements for a valid MOT with 1 comments.

Recorded mileage: 16,700

Recorded mileage: 16,700


PASS WITH RECTIFICATION


MOT TEST: 13 May 2016 08:55:52 PASSED
MOT TEST: 13 May 2016 08:55:52 PASSED

This test (367772316688) was completed on the 13 May 2016 08:55:52 and PASSED the requirements for a valid MOT with 1 comments.

This test (367772316688) was completed on the 13 May 2016 08:55:52 and PASSED the requirements for a valid MOT with 1 comments.

Recorded mileage: 15,163

Recorded mileage: 15,163


ADVISORY


MOT TEST: 11 May 2016 15:57:47 FAILED
MOT TEST: 11 May 2016 15:57:47 FAILED

This test (126382320201) was completed on the 11 May 2016 15:57:47 and FAILED the requirements for a valid MOT with 6 comments.

This test (126382320201) was completed on the 11 May 2016 15:57:47 and FAILED the requirements for a valid MOT with 6 comments.

Recorded mileage: 15,161

Recorded mileage: 15,161


FAIL


MOT TEST: 13 May 2015 09:05:44 PASSED
MOT TEST: 13 May 2015 09:05:44 PASSED

This test (477693235161) was completed on the 13 May 2015 09:05:44 and PASSED the requirements for a valid MOT with 0 comments.

This test (477693235161) was completed on the 13 May 2015 09:05:44 and PASSED the requirements for a valid MOT with 0 comments.

Recorded mileage: 14,082

Recorded mileage: 14,082


MOT TEST: 14 May 2014 09:54:04 PASSED
MOT TEST: 14 May 2014 09:54:04 PASSED

This test (306914234143) was completed on the 14 May 2014 09:54:04 and PASSED the requirements for a valid MOT with 0 comments.

This test (306914234143) was completed on the 14 May 2014 09:54:04 and PASSED the requirements for a valid MOT with 0 comments.

Recorded mileage: 13,227

Recorded mileage: 13,227


MOT TEST: 15 May 2013 12:44:34 PASSED
MOT TEST: 15 May 2013 12:44:34 PASSED

This test (277065033175) was completed on the 15 May 2013 12:44:34 and PASSED the requirements for a valid MOT with 0 comments.

This test (277065033175) was completed on the 15 May 2013 12:44:34 and PASSED the requirements for a valid MOT with 0 comments.

Recorded mileage: 12,583

Recorded mileage: 12,583


MOT TEST: 05 May 2012 11:09:31 PASSED
MOT TEST: 05 May 2012 11:09:31 PASSED

This test (178006622167) was completed on the 05 May 2012 11:09:31 and PASSED the requirements for a valid MOT with 0 comments.

This test (178006622167) was completed on the 05 May 2012 11:09:31 and PASSED the requirements for a valid MOT with 0 comments.

Recorded mileage: 11,822

Recorded mileage: 11,822


MOT TEST: 13 January 2011 10:22:34 PASSED
MOT TEST: 13 January 2011 10:22:34 PASSED

This test (595033611089) was completed on the 13 January 2011 10:22:34 and PASSED the requirements for a valid MOT with 0 comments.

This test (595033611089) was completed on the 13 January 2011 10:22:34 and PASSED the requirements for a valid MOT with 0 comments.

Recorded mileage: 8,977

Recorded mileage: 8,977


MOT TEST: 03 November 2009 15:50:10 PASSED
MOT TEST: 03 November 2009 15:50:10 PASSED

This test (231487709302) was completed on the 03 November 2009 15:50:10 and PASSED the requirements for a valid MOT with 0 comments.

This test (231487709302) was completed on the 03 November 2009 15:50:10 and PASSED the requirements for a valid MOT with 0 comments.

Recorded mileage: 6,574

Recorded mileage: 6,574