JBX 461N


JBX461N is registered to a Orange 1975, Morris Mini clubman with a Petrol engine. It Failed its most recent MOT Test on the 26 May 2010

8 unique faults (8 Total) reported in its MOT History (3 Tests).

0 common/recurring faults.

67% (2) MOT Pass Rate and a 33% (1) MOT Failure Rate.

57,152 recorded miles.

JBX 461N


JBX461N is registered to a Orange 1975, Morris Mini clubman with a Petrol engine. It Failed its most recent MOT Test on the 26 May 2010

8 unique faults (8 Total) reported in its MOT History (3 Tests).

0 common/recurring faults.

67% (2) MOT Pass Rate and a 33% (1) MOT Failure Rate.

57,152 recorded miles.

MOT PASS/Failure rate for JBX 461N

all MOT test results for JBX 461N represented as a percentage
MOT PASS/Failure rate for JBX 461N
all MOT test results for JBX 461N represented as a percentage

PERCENTAGE OF VEHICLE FAULTS WITH JBX 461N

ALL REPORTED FAULTS, DISPLAYED BY PERCENTAGE OF OCCURRENCE DURING ALL MOT TESTS
PERCENTAGE OF VEHICLE FAULTS WITH JBX 461N
ALL REPORTED FAULTS, DISPLAYED BY PERCENTAGE OF OCCURRENCE DURING ALL MOT TESTS
ADVISORY

FAIL

JBX 461N annual Faults by type

ALL REPORTED FAULTS, DISPLAYED over time and categorised by type
JBX 461N annual Faults by type
ALL REPORTED FAULTS, DISPLAYED over time and categorised by type

ALL JBX 461N ADVISORIES [5]

ALL ADVISORIES, ORDERED by OCCURRENCE DURING JBX 461N's MOT HISTORY
ALL JBX 461N ADVISORIES [5]
ALL ADVISORIES, ORDERED by OCCURRENCE DURING JBX 461N's MOT HISTORY
Advisory Faults | source www.vehiclestats.co.uk
Fault Fault Test Date Test Date/Time Reference MOT Test Reference
1 Nearside front suspension has slight play in a upper suspension ball joint (2.5.b.1a) Nearside front suspension has slight play in a upper suspension ball joint (2.5.b.1a) 03 April 2007 [08:48] 03/04/2007 710013497042 710013497042
1 Offside front suspension has slight play in a upper suspension ball joint (2.5.b.1a) Offside front suspension has slight play in a upper suspension ball joint (2.5.b.1a) 03 April 2007 [08:48] 03/04/2007 710013497042 710013497042
1 Nearside front suspension has slight play in a lower suspension ball joint (2.5.b.1a) Nearside front suspension has slight play in a lower suspension ball joint (2.5.b.1a) 03 April 2007 [08:48] 03/04/2007 710013497042 710013497042
1 Offside front suspension has slight play in a lower suspension ball joint (2.5.b.1a) Offside front suspension has slight play in a lower suspension ball joint (2.5.b.1a) 03 April 2007 [08:48] 03/04/2007 710013497042 710013497042
1 Offside front wheel bearing has slight play (2.5.a.3c) Offside front wheel bearing has slight play (2.5.a.3c) 03 April 2007 [08:48] 03/04/2007 710013497042 710013497042

ALL JBX 461N Failure Faults [3]

ALL Failure faults, ORDERED by OCCURRENCE DURING JBX 461N's MOT HISTORY
ALL JBX 461N Failure Faults [3]
ALL Failure faults, ORDERED by OCCURRENCE DURING JBX 461N's MOT HISTORY
Fail Faults | source www.vehiclestats.co.uk
Fault Fault Test Date Test Date/Time Reference MOT Test Reference
1 Offside front subframe mounting prescribed area is excessively corroded (2.4.a.3) Offside front subframe mounting prescribed area is excessively corroded (2.4.a.3) 06 May 2010 [09:26] 06/05/2010 793286720105 793286720105
1 Nearside rear subframe mounting prescribed area is excessively corroded (2.4.a.3) Nearside rear subframe mounting prescribed area is excessively corroded (2.4.a.3) 06 May 2010 [09:26] 06/05/2010 793286720105 793286720105
1 Nearside front constant velocity joint gaiter insecurely mounted to its housing (2.5.c.1a) Nearside front constant velocity joint gaiter insecurely mounted to its housing (2.5.c.1a) 06 May 2010 [09:26] 06/05/2010 793286720105 793286720105

MOT TEST: 26 May 2010 08:43:21 PASSED
MOT TEST: 26 May 2010 08:43:21 PASSED

This test (241346140173) was completed on the 26 May 2010 08:43:21 and PASSED the requirements for a valid MOT with 0 comments.

This test (241346140173) was completed on the 26 May 2010 08:43:21 and PASSED the requirements for a valid MOT with 0 comments.

Recorded mileage: 6,113

Recorded mileage: 6,113


MOT TEST: 06 May 2010 09:26:17 FAILED
MOT TEST: 06 May 2010 09:26:17 FAILED

This test (793286720105) was completed on the 06 May 2010 09:26:17 and FAILED the requirements for a valid MOT with 3 comments.

This test (793286720105) was completed on the 06 May 2010 09:26:17 and FAILED the requirements for a valid MOT with 3 comments.

Recorded mileage: 6,086

Recorded mileage: 6,086


FAIL


MOT TEST: 03 April 2007 08:48:28 PASSED
MOT TEST: 03 April 2007 08:48:28 PASSED

This test (710013497042) was completed on the 03 April 2007 08:48:28 and PASSED the requirements for a valid MOT with 5 comments.

This test (710013497042) was completed on the 03 April 2007 08:48:28 and PASSED the requirements for a valid MOT with 5 comments.

Recorded mileage: 57,152

Recorded mileage: 57,152


ADVISORY