JCC 377


JCC377 is registered to a Grey 1960, Morris Minor with a Petrol engine. It Failed its most recent MOT Test on the 22 March 2018

15 unique faults (18 Total) reported in its MOT History (11 Tests).

3 common/recurring faults, the most frequent (2 times) is: Slight play in nearside front trunnion..

73% (8) MOT Pass Rate and a 27% (3) MOT Failure Rate.

41,228 recorded miles.

JCC 377


JCC377 is registered to a Grey 1960, Morris Minor with a Petrol engine. It Failed its most recent MOT Test on the 22 March 2018

15 unique faults (18 Total) reported in its MOT History (11 Tests).

3 common/recurring faults, the most frequent (2 times) is: Slight play in nearside front trunnion..

73% (8) MOT Pass Rate and a 27% (3) MOT Failure Rate.

41,228 recorded miles.

MOT PASS/Failure rate for JCC 377

all MOT test results for JCC 377 represented as a percentage
MOT PASS/Failure rate for JCC 377
all MOT test results for JCC 377 represented as a percentage

PERCENTAGE OF VEHICLE FAULTS WITH JCC 377

ALL REPORTED FAULTS, DISPLAYED BY PERCENTAGE OF OCCURRENCE DURING ALL MOT TESTS
PERCENTAGE OF VEHICLE FAULTS WITH JCC 377
ALL REPORTED FAULTS, DISPLAYED BY PERCENTAGE OF OCCURRENCE DURING ALL MOT TESTS
ADVISORY

FAIL

PASS WITH RECTIFICATION

JCC 377 annual Faults by type

ALL REPORTED FAULTS, DISPLAYED over time and categorised by type
JCC 377 annual Faults by type
ALL REPORTED FAULTS, DISPLAYED over time and categorised by type

RECURRING FAULTS WITH JCC 377

FAULTS THAT HAVE OCCURED MORE THAN ONCE DURING JCC 377's MOT HISTORY
RECURRING FAULTS WITH JCC 377
FAULTS THAT HAVE OCCURED MORE THAN ONCE DURING JCC 377's MOT HISTORY
Fault Fault Test Date Test Date/Time Reference MOT Test Reference
2 Slight play in nearside front trunnion. Slight play in nearside front trunnion. 09 March 2016 [10:24] 09/03/2016 02 March 2016 [09:37] 02/03/2016 598792575799 598792575799 872772694147 872772694147
2 Nearside front wheel bearing has slight play (2.5.a.3c) Nearside front wheel bearing has slight play (2.5.a.3c) 31 August 2010 [12:53] 31/08/2010 31 August 2010 [12:53] 31/08/2010 110603840281 110603840281 130463640258 130463640258
2 Offside front wheel bearing has slight play (2.5.a.3c) Offside front wheel bearing has slight play (2.5.a.3c) 31 August 2010 [12:53] 31/08/2010 31 August 2010 [12:53] 31/08/2010 110603840281 110603840281 130463640258 130463640258

ALL JCC 377 ADVISORIES [6]

ALL ADVISORIES, ORDERED by OCCURRENCE DURING JCC 377's MOT HISTORY
ALL JCC 377 ADVISORIES [6]
ALL ADVISORIES, ORDERED by OCCURRENCE DURING JCC 377's MOT HISTORY
Advisory Faults | source www.vehiclestats.co.uk
Fault Fault Test Date Test Date/Time Reference MOT Test Reference
2 Slight play in nearside front trunnion. Slight play in nearside front trunnion. 09 March 2016 [10:24] 09/03/2016 02 March 2016 [09:37] 02/03/2016 598792575799 598792575799 872772694147 872772694147
2 Nearside front wheel bearing has slight play (2.5.a.3c) Nearside front wheel bearing has slight play (2.5.a.3c) 31 August 2010 [12:53] 31/08/2010 31 August 2010 [12:53] 31/08/2010 110603840281 110603840281 130463640258 130463640258
2 Offside front wheel bearing has slight play (2.5.a.3c) Offside front wheel bearing has slight play (2.5.a.3c) 31 August 2010 [12:53] 31/08/2010 31 August 2010 [12:53] 31/08/2010 110603840281 110603840281 130463640258 130463640258

ALL JCC 377 Failure Faults [10]

ALL Failure faults, ORDERED by OCCURRENCE DURING JCC 377's MOT HISTORY
ALL JCC 377 Failure Faults [10]
ALL Failure faults, ORDERED by OCCURRENCE DURING JCC 377's MOT HISTORY
Fail Faults | source www.vehiclestats.co.uk
Fault Fault Test Date Test Date/Time Reference MOT Test Reference
1 Registration plate lamp not working (1.1.c.1d) Registration plate lamp not working (1.1.c.1d) 02 March 2016 [09:37] 02/03/2016 872772694147 872772694147
1 Nearside steering rack gaiter split (2.2.d.2d) Nearside steering rack gaiter split (2.2.d.2d) 02 March 2016 [09:37] 02/03/2016 872772694147 872772694147
1 Offside steering rack gaiter split (2.2.d.2d) Offside steering rack gaiter split (2.2.d.2d) 02 March 2016 [09:37] 02/03/2016 872772694147 872772694147
1 Windscreen washer provides insufficient washer liquid (8.2.3) Windscreen washer provides insufficient washer liquid (8.2.3) 02 March 2016 [09:37] 02/03/2016 872772694147 872772694147
1 Nearside stop lamp not working (1.2.1b) Nearside stop lamp not working (1.2.1b) 15 April 2014 [13:12] 15/04/2014 245575704186 245575704186
1 Offside stop lamp not working (1.2.1b) Offside stop lamp not working (1.2.1b) 15 April 2014 [13:12] 15/04/2014 245575704186 245575704186
1 Offside rear position lamp(s) excessively deteriorated so that it is not visible from a reasonable distance (1.1.a.3d) Offside rear position lamp(s) excessively deteriorated so that it is not visible from a reasonable distance (1.1.a.3d) 15 April 2014 [13:12] 15/04/2014 245575704186 245575704186
1 Offside windscreen wiper does not clear the windscreen effectively (8.2.2) Offside windscreen wiper does not clear the windscreen effectively (8.2.2) 15 April 2014 [13:12] 15/04/2014 245575704186 245575704186
1 Nearside windscreen washer provides insufficient washer liquid (8.2.3) Nearside windscreen washer provides insufficient washer liquid (8.2.3) 15 April 2014 [13:12] 15/04/2014 245575704186 245575704186
1 Offside front wheel bearing has excessive play (2.5.a.3c) Offside front wheel bearing has excessive play (2.5.a.3c) 15 April 2014 [13:12] 15/04/2014 245575704186 245575704186

ALL JCC 377 Pass With Rectification Faults [2]

ALL Pass With Rectification faults, ORDERED by OCCURRENCE DURING JCC 377's MOT HISTORY
ALL JCC 377 Pass With Rectification Faults [2]
ALL Pass With Rectification faults, ORDERED by OCCURRENCE DURING JCC 377's MOT HISTORY
Pass With Rectification Faults | source www.vehiclestats.co.uk
Fault Fault Test Date Test Date/Time Reference MOT Test Reference
1 Offside steering locking device missing (2.2.c.1g) Offside steering locking device missing (2.2.c.1g) 31 August 2010 [12:53] 31/08/2010 110603840281 110603840281
1 Nearside front tyre fouling a part of the vehicle (4.1.d.2) Nearside front tyre fouling a part of the vehicle (4.1.d.2) 31 August 2010 [12:53] 31/08/2010 110603840281 110603840281

MOT TEST: 22 March 2018 14:18:46 PASSED
MOT TEST: 22 March 2018 14:18:46 PASSED

This test (965550742786) was completed on the 22 March 2018 14:18:46 and PASSED the requirements for a valid MOT with 0 comments.

This test (965550742786) was completed on the 22 March 2018 14:18:46 and PASSED the requirements for a valid MOT with 0 comments.

Recorded mileage: 41,228

Recorded mileage: 41,228


MOT TEST: 15 March 2017 12:49:03 PASSED
MOT TEST: 15 March 2017 12:49:03 PASSED

This test (134126209938) was completed on the 15 March 2017 12:49:03 and PASSED the requirements for a valid MOT with 0 comments.

This test (134126209938) was completed on the 15 March 2017 12:49:03 and PASSED the requirements for a valid MOT with 0 comments.

Recorded mileage: 41,180

Recorded mileage: 41,180


MOT TEST: 09 March 2016 10:24:06 PASSED
MOT TEST: 09 March 2016 10:24:06 PASSED

This test (598792575799) was completed on the 09 March 2016 10:24:06 and PASSED the requirements for a valid MOT with 1 comments.

This test (598792575799) was completed on the 09 March 2016 10:24:06 and PASSED the requirements for a valid MOT with 1 comments.

Recorded mileage: 41,094

Recorded mileage: 41,094


ADVISORY


MOT TEST: 02 March 2016 09:37:35 FAILED
MOT TEST: 02 March 2016 09:37:35 FAILED

This test (872772694147) was completed on the 02 March 2016 09:37:35 and FAILED the requirements for a valid MOT with 5 comments.

This test (872772694147) was completed on the 02 March 2016 09:37:35 and FAILED the requirements for a valid MOT with 5 comments.

Recorded mileage: 41,094

Recorded mileage: 41,094


ADVISORY

FAIL


MOT TEST: 10 April 2015 16:26:37 PASSED
MOT TEST: 10 April 2015 16:26:37 PASSED

This test (386710205183) was completed on the 10 April 2015 16:26:37 and PASSED the requirements for a valid MOT with 0 comments.

This test (386710205183) was completed on the 10 April 2015 16:26:37 and PASSED the requirements for a valid MOT with 0 comments.

Recorded mileage: 40,812

Recorded mileage: 40,812


MOT TEST: 17 April 2014 08:42:32 PASSED
MOT TEST: 17 April 2014 08:42:32 PASSED

This test (146187904181) was completed on the 17 April 2014 08:42:32 and PASSED the requirements for a valid MOT with 0 comments.

This test (146187904181) was completed on the 17 April 2014 08:42:32 and PASSED the requirements for a valid MOT with 0 comments.

Recorded mileage: 40,470

Recorded mileage: 40,470


MOT TEST: 15 April 2014 13:12:02 FAILED
MOT TEST: 15 April 2014 13:12:02 FAILED

This test (245575704186) was completed on the 15 April 2014 13:12:02 and FAILED the requirements for a valid MOT with 6 comments.

This test (245575704186) was completed on the 15 April 2014 13:12:02 and FAILED the requirements for a valid MOT with 6 comments.

Recorded mileage: 40,470

Recorded mileage: 40,470


FAIL


MOT TEST: 22 August 2011 10:34:17 PASSED
MOT TEST: 22 August 2011 10:34:17 PASSED

This test (615274531240) was completed on the 22 August 2011 10:34:17 and PASSED the requirements for a valid MOT with 0 comments.

This test (615274531240) was completed on the 22 August 2011 10:34:17 and PASSED the requirements for a valid MOT with 0 comments.

Recorded mileage: 40,469

Recorded mileage: 40,469


MOT TEST: 31 August 2010 12:53:41 FAILED
MOT TEST: 31 August 2010 12:53:41 FAILED

This test (110603840281) was completed on the 31 August 2010 12:53:41 and FAILED the requirements for a valid MOT with 4 comments.

This test (110603840281) was completed on the 31 August 2010 12:53:41 and FAILED the requirements for a valid MOT with 4 comments.

Recorded mileage: 40,452

Recorded mileage: 40,452


ADVISORY

PASS WITH RECTIFICATION


MOT TEST: 31 August 2010 12:53:41 PASSED
MOT TEST: 31 August 2010 12:53:41 PASSED

This test (130463640258) was completed on the 31 August 2010 12:53:41 and PASSED the requirements for a valid MOT with 2 comments.

This test (130463640258) was completed on the 31 August 2010 12:53:41 and PASSED the requirements for a valid MOT with 2 comments.

Recorded mileage: 40,452

Recorded mileage: 40,452


ADVISORY


MOT TEST: 13 November 2007 15:09:46 PASSED
MOT TEST: 13 November 2007 15:09:46 PASSED

This test (711057517343) was completed on the 13 November 2007 15:09:46 and PASSED the requirements for a valid MOT with 0 comments.

This test (711057517343) was completed on the 13 November 2007 15:09:46 and PASSED the requirements for a valid MOT with 0 comments.

Recorded mileage: 40,305

Recorded mileage: 40,305