JCC 761J


JCC761J is registered to a Red 1964, Morris Mini with a Petrol engine. It Failed its most recent MOT Test on the 15 June 2012

5 unique faults (5 Total) reported in its MOT History (7 Tests).

0 common/recurring faults.

71% (5) MOT Pass Rate and a 29% (2) MOT Failure Rate.

31,482 recorded miles.

JCC 761J


JCC761J is registered to a Red 1964, Morris Mini with a Petrol engine. It Failed its most recent MOT Test on the 15 June 2012

5 unique faults (5 Total) reported in its MOT History (7 Tests).

0 common/recurring faults.

71% (5) MOT Pass Rate and a 29% (2) MOT Failure Rate.

31,482 recorded miles.

MOT PASS/Failure rate for JCC 761J

all MOT test results for JCC 761J represented as a percentage
MOT PASS/Failure rate for JCC 761J
all MOT test results for JCC 761J represented as a percentage

PERCENTAGE OF VEHICLE FAULTS WITH JCC 761J

ALL REPORTED FAULTS, DISPLAYED BY PERCENTAGE OF OCCURRENCE DURING ALL MOT TESTS
PERCENTAGE OF VEHICLE FAULTS WITH JCC 761J
ALL REPORTED FAULTS, DISPLAYED BY PERCENTAGE OF OCCURRENCE DURING ALL MOT TESTS
FAIL

JCC 761J annual Faults by type

ALL REPORTED FAULTS, DISPLAYED over time and categorised by type
JCC 761J annual Faults by type
ALL REPORTED FAULTS, DISPLAYED over time and categorised by type

ALL JCC 761J Failure Faults [5]

ALL Failure faults, ORDERED by OCCURRENCE DURING JCC 761J's MOT HISTORY
ALL JCC 761J Failure Faults [5]
ALL Failure faults, ORDERED by OCCURRENCE DURING JCC 761J's MOT HISTORY
Fail Faults | source www.vehiclestats.co.uk
Fault Fault Test Date Test Date/Time Reference MOT Test Reference
1 Offside front ball joint has excessive play (2.2.b.1f) Offside front ball joint has excessive play (2.2.b.1f) 22 April 2009 [11:27] 22/04/2009 573252219129 573252219129
1 Steering system has excessive free play detected at the steering wheel (steering rack fitted) (2.2.a.1b) Steering system has excessive free play detected at the steering wheel (steering rack fitted) (2.2.a.1b) 25 April 2008 [11:57] 25/04/2008 260666018481 260666018481
1 Offside rear radius arm locating pin insecure (2.4.g.3a) Offside rear radius arm locating pin insecure (2.4.g.3a) 25 April 2008 [11:57] 25/04/2008 260666018481 260666018481
1 Offside steering locking device insecure (2.2.c.1g) Offside steering locking device insecure (2.2.c.1g) 25 April 2008 [11:57] 25/04/2008 260666018481 260666018481
1 Parking brake: efficiency below requirements (3.7.c.1b) Parking brake: efficiency below requirements (3.7.c.1b) 25 April 2008 [11:57] 25/04/2008 260666018481 260666018481

MOT TEST: 15 June 2012 12:54:49 PASSED
MOT TEST: 15 June 2012 12:54:49 PASSED

This test (605067462110) was completed on the 15 June 2012 12:54:49 and PASSED the requirements for a valid MOT with 0 comments.

This test (605067462110) was completed on the 15 June 2012 12:54:49 and PASSED the requirements for a valid MOT with 0 comments.

Recorded mileage: 31,482

Recorded mileage: 31,482


MOT TEST: 17 June 2011 11:16:08 PASSED
MOT TEST: 17 June 2011 11:16:08 PASSED

This test (496138161195) was completed on the 17 June 2011 11:16:08 and PASSED the requirements for a valid MOT with 0 comments.

This test (496138161195) was completed on the 17 June 2011 11:16:08 and PASSED the requirements for a valid MOT with 0 comments.

Recorded mileage: 31,250

Recorded mileage: 31,250


MOT TEST: 07 May 2010 10:51:30 PASSED
MOT TEST: 07 May 2010 10:51:30 PASSED

This test (650567020155) was completed on the 07 May 2010 10:51:30 and PASSED the requirements for a valid MOT with 0 comments.

This test (650567020155) was completed on the 07 May 2010 10:51:30 and PASSED the requirements for a valid MOT with 0 comments.

Recorded mileage: 31,110

Recorded mileage: 31,110


MOT TEST: 22 April 2009 14:28:43 PASSED
MOT TEST: 22 April 2009 14:28:43 PASSED

This test (481912519118) was completed on the 22 April 2009 14:28:43 and PASSED the requirements for a valid MOT with 0 comments.

This test (481912519118) was completed on the 22 April 2009 14:28:43 and PASSED the requirements for a valid MOT with 0 comments.

Recorded mileage: 30,905

Recorded mileage: 30,905


MOT TEST: 22 April 2009 11:27:06 FAILED
MOT TEST: 22 April 2009 11:27:06 FAILED

This test (573252219129) was completed on the 22 April 2009 11:27:06 and FAILED the requirements for a valid MOT with 1 comments.

This test (573252219129) was completed on the 22 April 2009 11:27:06 and FAILED the requirements for a valid MOT with 1 comments.

Recorded mileage: 30,905

Recorded mileage: 30,905


FAIL


MOT TEST: 13 May 2008 16:59:48 PASSED
MOT TEST: 13 May 2008 16:59:48 PASSED

This test (190384438176) was completed on the 13 May 2008 16:59:48 and PASSED the requirements for a valid MOT with 0 comments.

This test (190384438176) was completed on the 13 May 2008 16:59:48 and PASSED the requirements for a valid MOT with 0 comments.

Recorded mileage: 30,650

Recorded mileage: 30,650


MOT TEST: 25 April 2008 11:57:03 FAILED
MOT TEST: 25 April 2008 11:57:03 FAILED

This test (260666018481) was completed on the 25 April 2008 11:57:03 and FAILED the requirements for a valid MOT with 4 comments.

This test (260666018481) was completed on the 25 April 2008 11:57:03 and FAILED the requirements for a valid MOT with 4 comments.

Recorded mileage: 30,647

Recorded mileage: 30,647


FAIL