JCG 717E


JCG717E is registered to a Grey 1967, Morris Oxford with a Petrol engine. It Passed its most recent MOT Test on the 04 March 2019

28 unique faults (30 Total) reported in its MOT History (16 Tests).

2 common/recurring faults, the most frequent (2 times) is: Brakes imbalanced across an axle (3.7.B.5b).

81% (13) MOT Pass Rate and a 19% (3) MOT Failure Rate.

82,937 recorded miles.

JCG 717E


JCG717E is registered to a Grey 1967, Morris Oxford with a Petrol engine. It Passed its most recent MOT Test on the 04 March 2019

28 unique faults (30 Total) reported in its MOT History (16 Tests).

2 common/recurring faults, the most frequent (2 times) is: Brakes imbalanced across an axle (3.7.B.5b).

81% (13) MOT Pass Rate and a 19% (3) MOT Failure Rate.

82,937 recorded miles.

MOT PASS/Failure rate for JCG 717E

all MOT test results for JCG 717E represented as a percentage
MOT PASS/Failure rate for JCG 717E
all MOT test results for JCG 717E represented as a percentage

PERCENTAGE OF VEHICLE FAULTS WITH JCG 717E

ALL REPORTED FAULTS, DISPLAYED BY PERCENTAGE OF OCCURRENCE DURING ALL MOT TESTS
PERCENTAGE OF VEHICLE FAULTS WITH JCG 717E
ALL REPORTED FAULTS, DISPLAYED BY PERCENTAGE OF OCCURRENCE DURING ALL MOT TESTS
ADVISORY

FAIL

USER ENTERED

MINOR

JCG 717E annual Faults by type

ALL REPORTED FAULTS, DISPLAYED over time and categorised by type
JCG 717E annual Faults by type
ALL REPORTED FAULTS, DISPLAYED over time and categorised by type

RECURRING FAULTS WITH JCG 717E

FAULTS THAT HAVE OCCURED MORE THAN ONCE DURING JCG 717E's MOT HISTORY
RECURRING FAULTS WITH JCG 717E
FAULTS THAT HAVE OCCURED MORE THAN ONCE DURING JCG 717E's MOT HISTORY
Fault Fault Test Date Test Date/Time Reference MOT Test Reference
2 Brakes imbalanced across an axle (3.7.b.5b) Brakes imbalanced across an axle (3.7.b.5b) 02 March 2015 [15:38] 02/03/2015 15 December 2008 [10:14] 15/12/2008 638481665065 638481665065 134880258366 134880258366
2 Nearside windscreen washer provides insufficient washer liquid (8.2.3) Nearside windscreen washer provides insufficient washer liquid (8.2.3) 15 December 2008 [10:14] 15/12/2008 09 November 2007 [12:09] 09/11/2007 134880258366 134880258366 493883417407 493883417407

ALL JCG 717E ADVISORIES [15]

ALL ADVISORIES, ORDERED by OCCURRENCE DURING JCG 717E's MOT HISTORY
ALL JCG 717E ADVISORIES [15]
ALL ADVISORIES, ORDERED by OCCURRENCE DURING JCG 717E's MOT HISTORY
Advisory Faults | source www.vehiclestats.co.uk
Fault Fault Test Date Test Date/Time Reference MOT Test Reference
1 Exhaust has a minor leak of exhaust gases (6.1.2 (a)) Exhaust has a minor leak of exhaust gases (6.1.2 (a)) 04 March 2019 [12:06] 04/03/2019 968432979555 968432979555
1 Nearside front wheel bearing slightly noisy (5.1.3 (b) (i)) Nearside front wheel bearing slightly noisy (5.1.3 (b) (i)) 04 March 2019 [12:06] 04/03/2019 968432979555 968432979555
1 Front brakes imbalanced requirements only just met. It would appear that the braking system requires adjustment or repair. (1.2.1 (b) (i)) Front brakes imbalanced requirements only just met. It would appear that the braking system requires adjustment or repair. (1.2.1 (b) (i)) 04 March 2019 [12:06] 04/03/2019 968432979555 968432979555
1 Vehicle structure is corroded but structural rigidity is not significantly reduced underseal present and extensive weld present (6.1.1 (c) (i)) Vehicle structure is corroded but structural rigidity is not significantly reduced underseal present and extensive weld present (6.1.1 (c) (i)) 04 March 2019 [12:06] 04/03/2019 968432979555 968432979555
1 Nearside front floor chassis area slight corrosion Nearside front floor chassis area slight corrosion 13 March 2018 [11:52] 13/03/2018 228457066268 228457066268
1 Exhaust has a minor leak of exhaust gases (7.1.2) Exhaust has a minor leak of exhaust gases (7.1.2) 13 March 2018 [11:52] 13/03/2018 228457066268 228457066268
1 Front service brakes showing slight imbalance Front service brakes showing slight imbalance 13 March 2018 [11:52] 13/03/2018 228457066268 228457066268
1 Nearside front vehicle structure has slight corrosion (6.1.b.2) Nearside front vehicle structure has slight corrosion (6.1.b.2) 29 February 2016 [10:54] 29/02/2016 634222841013 634222841013
1 Offside front vehicle structure has slight corrosion (6.1.b.2) Offside front vehicle structure has slight corrosion (6.1.b.2) 29 February 2016 [10:54] 29/02/2016 634222841013 634222841013
1 Offside front front brake fluctuating, but not excessively (3.7.b.3) Offside front front brake fluctuating, but not excessively (3.7.b.3) 28 February 2014 [11:32] 28/02/2014 165749754477 165749754477
1 Brake pipe slightly corroded (3.6.b.2c) Brake pipe slightly corroded (3.6.b.2c) 26 February 2010 [10:51] 26/02/2010 591527650040 591527650040
1 Nearside front suspension component mounting prescribed area is corroded but not considered excessive (2.4.a.3) Nearside front suspension component mounting prescribed area is corroded but not considered excessive (2.4.a.3) 26 February 2010 [10:51] 26/02/2010 591527650040 591527650040
1 Centre exhaust has a minor leak of exhaust gases (7.1.2) Centre exhaust has a minor leak of exhaust gases (7.1.2) 15 December 2008 [10:14] 15/12/2008 134880258366 134880258366
1 Nearside rear leaf spring has slight wear in a shackle pin and/or bush (2.4.b.2) Nearside rear leaf spring has slight wear in a shackle pin and/or bush (2.4.b.2) 15 December 2008 [10:14] 15/12/2008 134880258366 134880258366
1 Axle king pin has slight play in pin and/or bush (2.5.a.3a) Axle king pin has slight play in pin and/or bush (2.5.a.3a) 09 November 2007 [12:09] 09/11/2007 493883417407 493883417407

ALL JCG 717E Failure Faults [12]

ALL Failure faults, ORDERED by OCCURRENCE DURING JCG 717E's MOT HISTORY
ALL JCG 717E Failure Faults [12]
ALL Failure faults, ORDERED by OCCURRENCE DURING JCG 717E's MOT HISTORY
Fail Faults | source www.vehiclestats.co.uk
Fault Fault Test Date Test Date/Time Reference MOT Test Reference
2 Brakes imbalanced across an axle (3.7.b.5b) Brakes imbalanced across an axle (3.7.b.5b) 02 March 2015 [15:38] 02/03/2015 15 December 2008 [10:14] 15/12/2008 638481665065 638481665065 134880258366 134880258366
2 Nearside windscreen washer provides insufficient washer liquid (8.2.3) Nearside windscreen washer provides insufficient washer liquid (8.2.3) 15 December 2008 [10:14] 15/12/2008 09 November 2007 [12:09] 09/11/2007 134880258366 134880258366 493883417407 493883417407
1 Offside rear brake recording little or no effort (3.7.b.5a) Offside rear brake recording little or no effort (3.7.b.5a) 02 March 2015 [15:38] 02/03/2015 638481665065 638481665065
1 Offside rear parking brake recording little or no effort (3.7.b.6a) Offside rear parking brake recording little or no effort (3.7.b.6a) 02 March 2015 [15:38] 02/03/2015 638481665065 638481665065
1 Parking brake: efficiency below requirements (3.7.b.7) Parking brake: efficiency below requirements (3.7.b.7) 02 March 2015 [15:38] 02/03/2015 638481665065 638481665065
1 Front exhaust has a major leak of exhaust gases (7.1.2) Front exhaust has a major leak of exhaust gases (7.1.2) 15 December 2008 [10:14] 15/12/2008 134880258366 134880258366
1 Nearside front position lamp(s) not working (1.1.a.3b) Nearside front position lamp(s) not working (1.1.a.3b) 15 December 2008 [10:14] 15/12/2008 134880258366 134880258366
1 Offside rear position lamp(s) incorrect colour (1.1.a.3e) Offside rear position lamp(s) incorrect colour (1.1.a.3e) 15 December 2008 [10:14] 15/12/2008 134880258366 134880258366
1 Windscreen wiper does not clear the windscreen effectively (8.2.2) Windscreen wiper does not clear the windscreen effectively (8.2.2) 09 November 2007 [12:09] 09/11/2007 493883417407 493883417407
1 Horn not working (1.6.2a) Horn not working (1.6.2a) 09 November 2007 [12:09] 09/11/2007 493883417407 493883417407

ALL JCG 717E minor Faults [1]

ALL minor faults, ORDERED by OCCURRENCE DURING JCG 717E's MOT HISTORY
ALL JCG 717E minor Faults [1]
ALL minor faults, ORDERED by OCCURRENCE DURING JCG 717E's MOT HISTORY
Advisory Faults | source www.vehiclestats.co.uk
Fault Fault Test Date Test Date/Time Reference MOT Test Reference
1 Nearside front windscreen wiper blade defective (3.4 (b) (i)) Nearside front windscreen wiper blade defective (3.4 (b) (i)) 04 March 2019 [12:06] 04/03/2019 968432979555 968432979555

ALL JCG 717E User Entered Faults [2]

ALL User Entered faults, ORDERED by OCCURRENCE DURING JCG 717E's MOT HISTORY
ALL JCG 717E User Entered Faults [2]
ALL User Entered faults, ORDERED by OCCURRENCE DURING JCG 717E's MOT HISTORY
Fail Faults | source www.vehiclestats.co.uk
Fault Fault Test Date Test Date/Time Reference MOT Test Reference
1 Slight play in steering box drop arm and idler joints Slight play in steering box drop arm and idler joints 09 November 2007 [12:09] 09/11/2007 493883417407 493883417407
1 Exhaust back box baffles loose Exhaust back box baffles loose 09 November 2007 [12:09] 09/11/2007 493883417407 493883417407

MOT TEST: 04 March 2019 12:06:38 PASSED
MOT TEST: 04 March 2019 12:06:38 PASSED

This test (968432979555) was completed on the 04 March 2019 12:06:38 and PASSED the requirements for a valid MOT with 5 comments.

This test (968432979555) was completed on the 04 March 2019 12:06:38 and PASSED the requirements for a valid MOT with 5 comments.

Recorded mileage: 82,937

Recorded mileage: 82,937


ADVISORY

MINOR


MOT TEST: 13 March 2018 11:52:42 PASSED
MOT TEST: 13 March 2018 11:52:42 PASSED

This test (228457066268) was completed on the 13 March 2018 11:52:42 and PASSED the requirements for a valid MOT with 3 comments.

This test (228457066268) was completed on the 13 March 2018 11:52:42 and PASSED the requirements for a valid MOT with 3 comments.

Recorded mileage: 78,283

Recorded mileage: 78,283


ADVISORY


MOT TEST: 18 March 2017 11:24:14 PASSED
MOT TEST: 18 March 2017 11:24:14 PASSED

This test (105593317248) was completed on the 18 March 2017 11:24:14 and PASSED the requirements for a valid MOT with 0 comments.

This test (105593317248) was completed on the 18 March 2017 11:24:14 and PASSED the requirements for a valid MOT with 0 comments.

Recorded mileage: 73,493

Recorded mileage: 73,493


MOT TEST: 29 February 2016 10:54:31 PASSED
MOT TEST: 29 February 2016 10:54:31 PASSED

This test (634222841013) was completed on the 29 February 2016 10:54:31 and PASSED the requirements for a valid MOT with 2 comments.

This test (634222841013) was completed on the 29 February 2016 10:54:31 and PASSED the requirements for a valid MOT with 2 comments.

Recorded mileage: 68,089

Recorded mileage: 68,089


ADVISORY


MOT TEST: 04 March 2015 13:51:54 PASSED
MOT TEST: 04 March 2015 13:51:54 PASSED

This test (126653065442) was completed on the 04 March 2015 13:51:54 and PASSED the requirements for a valid MOT with 0 comments.

This test (126653065442) was completed on the 04 March 2015 13:51:54 and PASSED the requirements for a valid MOT with 0 comments.

Recorded mileage: 62,777

Recorded mileage: 62,777


MOT TEST: 02 March 2015 15:38:40 FAILED
MOT TEST: 02 March 2015 15:38:40 FAILED

This test (638481665065) was completed on the 02 March 2015 15:38:40 and FAILED the requirements for a valid MOT with 4 comments.

This test (638481665065) was completed on the 02 March 2015 15:38:40 and FAILED the requirements for a valid MOT with 4 comments.

Recorded mileage: 62,774

Recorded mileage: 62,774


FAIL


MOT TEST: 28 February 2014 11:32:57 PASSED
MOT TEST: 28 February 2014 11:32:57 PASSED

This test (165749754477) was completed on the 28 February 2014 11:32:57 and PASSED the requirements for a valid MOT with 1 comments.

This test (165749754477) was completed on the 28 February 2014 11:32:57 and PASSED the requirements for a valid MOT with 1 comments.

Recorded mileage: 59,817

Recorded mileage: 59,817


ADVISORY


MOT TEST: 13 February 2013 09:14:38 PASSED
MOT TEST: 13 February 2013 09:14:38 PASSED

This test (185894943441) was completed on the 13 February 2013 09:14:38 and PASSED the requirements for a valid MOT with 0 comments.

This test (185894943441) was completed on the 13 February 2013 09:14:38 and PASSED the requirements for a valid MOT with 0 comments.

Recorded mileage: 59,781

Recorded mileage: 59,781


MOT TEST: 21 February 2012 10:06:30 PASSED
MOT TEST: 21 February 2012 10:06:30 PASSED

This test (257532752040) was completed on the 21 February 2012 10:06:30 and PASSED the requirements for a valid MOT with 0 comments.

This test (257532752040) was completed on the 21 February 2012 10:06:30 and PASSED the requirements for a valid MOT with 0 comments.

Recorded mileage: 59,111

Recorded mileage: 59,111


MOT TEST: 15 February 2011 10:23:47 PASSED
MOT TEST: 15 February 2011 10:23:47 PASSED

This test (116996541466) was completed on the 15 February 2011 10:23:47 and PASSED the requirements for a valid MOT with 0 comments.

This test (116996541466) was completed on the 15 February 2011 10:23:47 and PASSED the requirements for a valid MOT with 0 comments.

Recorded mileage: 58,688

Recorded mileage: 58,688


MOT TEST: 26 February 2010 10:51:32 PASSED
MOT TEST: 26 February 2010 10:51:32 PASSED

This test (591527650040) was completed on the 26 February 2010 10:51:32 and PASSED the requirements for a valid MOT with 2 comments.

This test (591527650040) was completed on the 26 February 2010 10:51:32 and PASSED the requirements for a valid MOT with 2 comments.

Recorded mileage: 57,322

Recorded mileage: 57,322


ADVISORY


MOT TEST: 18 December 2008 14:04:51 PASSED
MOT TEST: 18 December 2008 14:04:51 PASSED

This test (270743058358) was completed on the 18 December 2008 14:04:51 and PASSED the requirements for a valid MOT with 0 comments.

This test (270743058358) was completed on the 18 December 2008 14:04:51 and PASSED the requirements for a valid MOT with 0 comments.

Recorded mileage: 55,646

Recorded mileage: 55,646


MOT TEST: 15 December 2008 10:14:58 FAILED
MOT TEST: 15 December 2008 10:14:58 FAILED

This test (134880258366) was completed on the 15 December 2008 10:14:58 and FAILED the requirements for a valid MOT with 7 comments.

This test (134880258366) was completed on the 15 December 2008 10:14:58 and FAILED the requirements for a valid MOT with 7 comments.

Recorded mileage: 55,646

Recorded mileage: 55,646


ADVISORY

FAIL


MOT TEST: 14 November 2007 08:54:14 PASSED
MOT TEST: 14 November 2007 08:54:14 PASSED

This test (532408617392) was completed on the 14 November 2007 08:54:14 and PASSED the requirements for a valid MOT with 0 comments.

This test (532408617392) was completed on the 14 November 2007 08:54:14 and PASSED the requirements for a valid MOT with 0 comments.

Recorded mileage: 54,721

Recorded mileage: 54,721


MOT TEST: 09 November 2007 12:09:39 FAILED
MOT TEST: 09 November 2007 12:09:39 FAILED

This test (493883417407) was completed on the 09 November 2007 12:09:39 and FAILED the requirements for a valid MOT with 6 comments.

This test (493883417407) was completed on the 09 November 2007 12:09:39 and FAILED the requirements for a valid MOT with 6 comments.

Recorded mileage: 54,721

Recorded mileage: 54,721


ADVISORY

FAIL

USER ENTERED


MOT TEST: 06 November 2006 14:29:47 PASSED
MOT TEST: 06 November 2006 14:29:47 PASSED

This test (224420316354) was completed on the 06 November 2006 14:29:47 and PASSED the requirements for a valid MOT with 0 comments.

This test (224420316354) was completed on the 06 November 2006 14:29:47 and PASSED the requirements for a valid MOT with 0 comments.

Recorded mileage: 54,188

Recorded mileage: 54,188