JCG 929N


JCG929N is registered to a Yellow 1975, Morris Mini 1275 gt with a Petrol engine. It Passed its most recent MOT Test on the 13 June 2018

11 unique faults (11 Total) reported in its MOT History (2 Tests).

0 common/recurring faults.

50% (1) MOT Pass Rate and a 50% (1) MOT Failure Rate.

53,688 recorded miles.

JCG 929N


JCG929N is registered to a Yellow 1975, Morris Mini 1275 gt with a Petrol engine. It Passed its most recent MOT Test on the 13 June 2018

11 unique faults (11 Total) reported in its MOT History (2 Tests).

0 common/recurring faults.

50% (1) MOT Pass Rate and a 50% (1) MOT Failure Rate.

53,688 recorded miles.

MOT PASS/Failure rate for JCG 929N

all MOT test results for JCG 929N represented as a percentage
MOT PASS/Failure rate for JCG 929N
all MOT test results for JCG 929N represented as a percentage

PERCENTAGE OF VEHICLE FAULTS WITH JCG 929N

ALL REPORTED FAULTS, DISPLAYED BY PERCENTAGE OF OCCURRENCE DURING ALL MOT TESTS
PERCENTAGE OF VEHICLE FAULTS WITH JCG 929N
ALL REPORTED FAULTS, DISPLAYED BY PERCENTAGE OF OCCURRENCE DURING ALL MOT TESTS
FAIL

JCG 929N annual Faults by type

ALL REPORTED FAULTS, DISPLAYED over time and categorised by type
JCG 929N annual Faults by type
ALL REPORTED FAULTS, DISPLAYED over time and categorised by type

ALL JCG 929N Failure Faults [11]

ALL Failure faults, ORDERED by OCCURRENCE DURING JCG 929N's MOT HISTORY
ALL JCG 929N Failure Faults [11]
ALL Failure faults, ORDERED by OCCURRENCE DURING JCG 929N's MOT HISTORY
Fail Faults | source www.vehiclestats.co.uk
Fault Fault Test Date Test Date/Time Reference MOT Test Reference
1 Nearside rear registration plate lamp not working (1.1.5c) Nearside rear registration plate lamp not working (1.1.5c) 03 March 2008 [17:44] 03/03/2008 604523268068 604523268068
1 Nearside rear rear position lamp(s) incorrect colour (1.1.a.3e) Nearside rear rear position lamp(s) incorrect colour (1.1.a.3e) 03 March 2008 [17:44] 03/03/2008 604523268068 604523268068
1 Offside rear rear position lamp(s) incorrect colour (1.1.a.3e) Offside rear rear position lamp(s) incorrect colour (1.1.a.3e) 03 March 2008 [17:44] 03/03/2008 604523268068 604523268068
1 Offside front seat belt anchorage prescribed area is excessively corroded (5.2.6) Offside front seat belt anchorage prescribed area is excessively corroded (5.2.6) 03 March 2008 [17:44] 03/03/2008 604523268068 604523268068
1 Rear sub-frame corroded and seriously weakened (2.4.g.1) Rear sub-frame corroded and seriously weakened (2.4.g.1) 03 March 2008 [17:44] 03/03/2008 604523268068 604523268068
1 Nearside front subframe mounting prescribed area is excessively corroded (2.4.a.3) Nearside front subframe mounting prescribed area is excessively corroded (2.4.a.3) 03 March 2008 [17:44] 03/03/2008 604523268068 604523268068
1 Nearside front brake pipe excessively corroded (3.6.b.2c) Nearside front brake pipe excessively corroded (3.6.b.2c) 03 March 2008 [17:44] 03/03/2008 604523268068 604523268068
1 Offside front brake pipe excessively corroded (3.6.b.2c) Offside front brake pipe excessively corroded (3.6.b.2c) 03 March 2008 [17:44] 03/03/2008 604523268068 604523268068
1 Brake performance not tested (3.7.a.1) Brake performance not tested (3.7.a.1) 03 March 2008 [17:44] 03/03/2008 604523268068 604523268068
1 Service brake: efficiency below requirements (3.7.b.7) Service brake: efficiency below requirements (3.7.b.7) 03 March 2008 [17:44] 03/03/2008 604523268068 604523268068
1 Parking brake: efficiency below requirements (3.7.b.7) Parking brake: efficiency below requirements (3.7.b.7) 03 March 2008 [17:44] 03/03/2008 604523268068 604523268068

MOT TEST: 13 June 2018 14:44:58 PASSED
MOT TEST: 13 June 2018 14:44:58 PASSED

This test (855308034497) was completed on the 13 June 2018 14:44:58 and PASSED the requirements for a valid MOT with 0 comments.

This test (855308034497) was completed on the 13 June 2018 14:44:58 and PASSED the requirements for a valid MOT with 0 comments.

Recorded mileage: 53,688

Recorded mileage: 53,688


MOT TEST: 03 March 2008 17:44:41 FAILED
MOT TEST: 03 March 2008 17:44:41 FAILED

This test (604523268068) was completed on the 03 March 2008 17:44:41 and FAILED the requirements for a valid MOT with 11 comments.

This test (604523268068) was completed on the 03 March 2008 17:44:41 and FAILED the requirements for a valid MOT with 11 comments.

Recorded mileage: 53,551

Recorded mileage: 53,551


FAIL