JCH 906D


JCH906D is registered to a Cream 1966, Morris Minor 1000 with a Petrol engine. It Passed its most recent MOT Test on the 08 April 2019

22 unique faults (26 Total) reported in its MOT History (18 Tests).

4 common/recurring faults, the most frequent (2 times) is: n/s/f tyre worn on outer edge.

61% (11) MOT Pass Rate and a 39% (7) MOT Failure Rate.

76,638 recorded miles.

JCH 906D


JCH906D is registered to a Cream 1966, Morris Minor 1000 with a Petrol engine. It Passed its most recent MOT Test on the 08 April 2019

22 unique faults (26 Total) reported in its MOT History (18 Tests).

4 common/recurring faults, the most frequent (2 times) is: n/s/f tyre worn on outer edge.

61% (11) MOT Pass Rate and a 39% (7) MOT Failure Rate.

76,638 recorded miles.

MOT PASS/Failure rate for JCH 906D

all MOT test results for JCH 906D represented as a percentage
MOT PASS/Failure rate for JCH 906D
all MOT test results for JCH 906D represented as a percentage

PERCENTAGE OF VEHICLE FAULTS WITH JCH 906D

ALL REPORTED FAULTS, DISPLAYED BY PERCENTAGE OF OCCURRENCE DURING ALL MOT TESTS
PERCENTAGE OF VEHICLE FAULTS WITH JCH 906D
ALL REPORTED FAULTS, DISPLAYED BY PERCENTAGE OF OCCURRENCE DURING ALL MOT TESTS
ADVISORY

FAIL

USER ENTERED

PASS WITH RECTIFICATION

JCH 906D annual Faults by type

ALL REPORTED FAULTS, DISPLAYED over time and categorised by type
JCH 906D annual Faults by type
ALL REPORTED FAULTS, DISPLAYED over time and categorised by type

RECURRING FAULTS WITH JCH 906D

FAULTS THAT HAVE OCCURED MORE THAN ONCE DURING JCH 906D's MOT HISTORY
RECURRING FAULTS WITH JCH 906D
FAULTS THAT HAVE OCCURED MORE THAN ONCE DURING JCH 906D's MOT HISTORY
Fault Fault Test Date Test Date/Time Reference MOT Test Reference
2 N/s/f tyre worn on outer edge N/s/f tyre worn on outer edge 16 April 2014 [15:18] 16/04/2014 07 April 2014 [12:36] 07/04/2014 995676304180 995676304180 359747994065 359747994065
2 Stop lamp not working (1.2.1b) Stop lamp not working (1.2.1b) 07 April 2014 [12:36] 07/04/2014 25 February 2013 [14:31] 25/02/2013 359747994065 359747994065 909066253082 909066253082
2 Parking brake: efficiency below requirements (3.7.b.7) Parking brake: efficiency below requirements (3.7.b.7) 28 March 2009 [10:52] 28/03/2009 15 March 2008 [11:39] 15/03/2008 650207889094 650207889094 584855978014 584855978014
2 Offside rear direction indicator deteriorated, but still visible from a reasonable distance (1.4.a.2e) Offside rear direction indicator deteriorated, but still visible from a reasonable distance (1.4.a.2e) 21 March 2008 [12:45] 21/03/2008 15 March 2008 [11:39] 15/03/2008 322541588091 322541588091 584855978014 584855978014

ALL JCH 906D ADVISORIES [3]

ALL ADVISORIES, ORDERED by OCCURRENCE DURING JCH 906D's MOT HISTORY
ALL JCH 906D ADVISORIES [3]
ALL ADVISORIES, ORDERED by OCCURRENCE DURING JCH 906D's MOT HISTORY
Advisory Faults | source www.vehiclestats.co.uk
Fault Fault Test Date Test Date/Time Reference MOT Test Reference
2 Offside rear direction indicator deteriorated, but still visible from a reasonable distance (1.4.a.2e) Offside rear direction indicator deteriorated, but still visible from a reasonable distance (1.4.a.2e) 21 March 2008 [12:45] 21/03/2008 15 March 2008 [11:39] 15/03/2008 322541588091 322541588091 584855978014 584855978014
1 Nearside front tyre worn close to the legal limit (4.1.e.1) Nearside front tyre worn close to the legal limit (4.1.e.1) 25 February 2013 [14:31] 25/02/2013 909066253082 909066253082

ALL JCH 906D Failure Faults [19]

ALL Failure faults, ORDERED by OCCURRENCE DURING JCH 906D's MOT HISTORY
ALL JCH 906D Failure Faults [19]
ALL Failure faults, ORDERED by OCCURRENCE DURING JCH 906D's MOT HISTORY
Fail Faults | source www.vehiclestats.co.uk
Fault Fault Test Date Test Date/Time Reference MOT Test Reference
2 Stop lamp not working (1.2.1b) Stop lamp not working (1.2.1b) 07 April 2014 [12:36] 07/04/2014 25 February 2013 [14:31] 25/02/2013 359747994065 359747994065 909066253082 909066253082
2 Parking brake: efficiency below requirements (3.7.b.7) Parking brake: efficiency below requirements (3.7.b.7) 28 March 2009 [10:52] 28/03/2009 15 March 2008 [11:39] 15/03/2008 650207889094 650207889094 584855978014 584855978014
1 Exhaust has a major leak of exhaust gases (7.1.2) Exhaust has a major leak of exhaust gases (7.1.2) 23 April 2015 [10:42] 23/04/2015 947333615199 947333615199
1 Windscreen washer provides insufficient washer liquid (8.2.3) Windscreen washer provides insufficient washer liquid (8.2.3) 07 April 2014 [12:36] 07/04/2014 359747994065 359747994065
1 Offside rear brake binding (3.7.b.1) Offside rear brake binding (3.7.b.1) 07 April 2014 [12:36] 07/04/2014 359747994065 359747994065
1 Offside rear direction indicator incorrect colour (1.4.a.2f) Offside rear direction indicator incorrect colour (1.4.a.2f) 25 February 2013 [14:31] 25/02/2013 909066253082 909066253082
1 Fuel cap/sealing device sealing washer missing (7.2.4c) Fuel cap/sealing device sealing washer missing (7.2.4c) 10 February 2012 [09:41] 10/02/2012 337831442063 337831442063
1 Horn not working (1.6.2a) Horn not working (1.6.2a) 10 February 2012 [09:41] 10/02/2012 337831442063 337831442063
1 Rear rear brake binding (3.7.b.1) Rear rear brake binding (3.7.b.1) 10 February 2012 [09:41] 10/02/2012 337831442063 337831442063
1 Parking brake: efficiency below requirements (3.7.c.1b) Parking brake: efficiency below requirements (3.7.c.1b) 10 February 2012 [09:41] 10/02/2012 337831442063 337831442063
1 Front exhaust has a major leak of exhaust gases (7.1.2) Front exhaust has a major leak of exhaust gases (7.1.2) 28 March 2009 [10:52] 28/03/2009 650207889094 650207889094
1 Nearside rear brake lever has restricted free movement (3.5.1k) Nearside rear brake lever has restricted free movement (3.5.1k) 28 March 2009 [10:52] 28/03/2009 650207889094 650207889094
1 Nearside front wheel bearing has excessive play (2.5.a.3c) Nearside front wheel bearing has excessive play (2.5.a.3c) 28 March 2009 [10:52] 28/03/2009 650207889094 650207889094
1 Offside front wheel bearing has excessive play (2.5.a.3c) Offside front wheel bearing has excessive play (2.5.a.3c) 28 March 2009 [10:52] 28/03/2009 650207889094 650207889094
1 Service brake: efficiency below requirements (3.7.b.7) Service brake: efficiency below requirements (3.7.b.7) 28 March 2009 [10:52] 28/03/2009 650207889094 650207889094
1 Nearside rear brake recording little or no effort (3.7.b.5a) Nearside rear brake recording little or no effort (3.7.b.5a) 15 March 2008 [11:39] 15/03/2008 584855978014 584855978014
1 Nearside rear parking brake recording little or no effort (3.7.b.6a) Nearside rear parking brake recording little or no effort (3.7.b.6a) 15 March 2008 [11:39] 15/03/2008 584855978014 584855978014

ALL JCH 906D User Entered Faults [3]

ALL User Entered faults, ORDERED by OCCURRENCE DURING JCH 906D's MOT HISTORY
ALL JCH 906D User Entered Faults [3]
ALL User Entered faults, ORDERED by OCCURRENCE DURING JCH 906D's MOT HISTORY
User Entered Faults | source www.vehiclestats.co.uk
Fault Fault Test Date Test Date/Time Reference MOT Test Reference
2 N/s/f tyre worn on outer edge N/s/f tyre worn on outer edge 16 April 2014 [15:18] 16/04/2014 07 April 2014 [12:36] 07/04/2014 995676304180 995676304180 359747994065 359747994065
1 Play in near side front lower trunnion Play in near side front lower trunnion 17 March 2007 [10:46] 17/03/2007 174736877495 174736877495

ALL JCH 906D Pass With Rectification Faults [1]

ALL Pass With Rectification faults, ORDERED by OCCURRENCE DURING JCH 906D's MOT HISTORY
ALL JCH 906D Pass With Rectification Faults [1]
ALL Pass With Rectification faults, ORDERED by OCCURRENCE DURING JCH 906D's MOT HISTORY
Pass With Rectification Faults | source www.vehiclestats.co.uk
Fault Fault Test Date Test Date/Time Reference MOT Test Reference
1 Nearside front headlamp not working on main beam (1.7.5a) Nearside front headlamp not working on main beam (1.7.5a) 21 August 2017 [08:39] 21/08/2017 385456983281 385456983281

MOT TEST: 08 April 2019 14:27:01 PASSED
MOT TEST: 08 April 2019 14:27:01 PASSED

This test (446344076622) was completed on the 08 April 2019 14:27:01 and PASSED the requirements for a valid MOT with 0 comments.

This test (446344076622) was completed on the 08 April 2019 14:27:01 and PASSED the requirements for a valid MOT with 0 comments.

Recorded mileage: 76,638

Recorded mileage: 76,638


MOT TEST: 21 August 2017 08:39:07 PASSED
MOT TEST: 21 August 2017 08:39:07 PASSED

This test (775683340535) was completed on the 21 August 2017 08:39:07 and PASSED the requirements for a valid MOT with 0 comments.

This test (775683340535) was completed on the 21 August 2017 08:39:07 and PASSED the requirements for a valid MOT with 0 comments.

Recorded mileage: 76,421

Recorded mileage: 76,421


MOT TEST: 21 August 2017 08:39:06 FAILED
MOT TEST: 21 August 2017 08:39:06 FAILED

This test (385456983281) was completed on the 21 August 2017 08:39:06 and FAILED the requirements for a valid MOT with 1 comments.

This test (385456983281) was completed on the 21 August 2017 08:39:06 and FAILED the requirements for a valid MOT with 1 comments.

Recorded mileage: 76,421

Recorded mileage: 76,421


PASS WITH RECTIFICATION


MOT TEST: 13 May 2016 14:26:32 PASSED
MOT TEST: 13 May 2016 14:26:32 PASSED

This test (459943188854) was completed on the 13 May 2016 14:26:32 and PASSED the requirements for a valid MOT with 0 comments.

This test (459943188854) was completed on the 13 May 2016 14:26:32 and PASSED the requirements for a valid MOT with 0 comments.

Recorded mileage: 76,307

Recorded mileage: 76,307


MOT TEST: 24 April 2015 16:59:37 PASSED
MOT TEST: 24 April 2015 16:59:37 PASSED

This test (968474115133) was completed on the 24 April 2015 16:59:37 and PASSED the requirements for a valid MOT with 0 comments.

This test (968474115133) was completed on the 24 April 2015 16:59:37 and PASSED the requirements for a valid MOT with 0 comments.

Recorded mileage: 76,226

Recorded mileage: 76,226


MOT TEST: 23 April 2015 10:42:29 FAILED
MOT TEST: 23 April 2015 10:42:29 FAILED

This test (947333615199) was completed on the 23 April 2015 10:42:29 and FAILED the requirements for a valid MOT with 1 comments.

This test (947333615199) was completed on the 23 April 2015 10:42:29 and FAILED the requirements for a valid MOT with 1 comments.

Recorded mileage: 76,226

Recorded mileage: 76,226


FAIL


MOT TEST: 16 April 2014 15:18:40 PASSED
MOT TEST: 16 April 2014 15:18:40 PASSED

This test (995676304180) was completed on the 16 April 2014 15:18:40 and PASSED the requirements for a valid MOT with 1 comments.

This test (995676304180) was completed on the 16 April 2014 15:18:40 and PASSED the requirements for a valid MOT with 1 comments.

Recorded mileage: 75,793

Recorded mileage: 75,793


USER ENTERED


MOT TEST: 07 April 2014 12:36:39 FAILED
MOT TEST: 07 April 2014 12:36:39 FAILED

This test (359747994065) was completed on the 07 April 2014 12:36:39 and FAILED the requirements for a valid MOT with 4 comments.

This test (359747994065) was completed on the 07 April 2014 12:36:39 and FAILED the requirements for a valid MOT with 4 comments.

Recorded mileage: 75,793

Recorded mileage: 75,793


FAIL

USER ENTERED


MOT TEST: 04 March 2013 15:48:24 PASSED
MOT TEST: 04 March 2013 15:48:24 PASSED

This test (857023063024) was completed on the 04 March 2013 15:48:24 and PASSED the requirements for a valid MOT with 0 comments.

This test (857023063024) was completed on the 04 March 2013 15:48:24 and PASSED the requirements for a valid MOT with 0 comments.

Recorded mileage: 74,901

Recorded mileage: 74,901


MOT TEST: 25 February 2013 14:31:16 FAILED
MOT TEST: 25 February 2013 14:31:16 FAILED

This test (909066253082) was completed on the 25 February 2013 14:31:16 and FAILED the requirements for a valid MOT with 3 comments.

This test (909066253082) was completed on the 25 February 2013 14:31:16 and FAILED the requirements for a valid MOT with 3 comments.

Recorded mileage: 74,898

Recorded mileage: 74,898


ADVISORY

FAIL


MOT TEST: 17 February 2012 11:35:01 PASSED
MOT TEST: 17 February 2012 11:35:01 PASSED

This test (695258142015) was completed on the 17 February 2012 11:35:01 and PASSED the requirements for a valid MOT with 0 comments.

This test (695258142015) was completed on the 17 February 2012 11:35:01 and PASSED the requirements for a valid MOT with 0 comments.

Recorded mileage: 72,831

Recorded mileage: 72,831


MOT TEST: 10 February 2012 09:41:44 FAILED
MOT TEST: 10 February 2012 09:41:44 FAILED

This test (337831442063) was completed on the 10 February 2012 09:41:44 and FAILED the requirements for a valid MOT with 4 comments.

This test (337831442063) was completed on the 10 February 2012 09:41:44 and FAILED the requirements for a valid MOT with 4 comments.

Recorded mileage: 72,831

Recorded mileage: 72,831


FAIL


MOT TEST: 20 April 2009 17:31:22 PASSED
MOT TEST: 20 April 2009 17:31:22 PASSED

This test (650240319103) was completed on the 20 April 2009 17:31:22 and PASSED the requirements for a valid MOT with 0 comments.

This test (650240319103) was completed on the 20 April 2009 17:31:22 and PASSED the requirements for a valid MOT with 0 comments.

Recorded mileage: 70,771

Recorded mileage: 70,771


MOT TEST: 28 March 2009 10:52:56 FAILED
MOT TEST: 28 March 2009 10:52:56 FAILED

This test (650207889094) was completed on the 28 March 2009 10:52:56 and FAILED the requirements for a valid MOT with 6 comments.

This test (650207889094) was completed on the 28 March 2009 10:52:56 and FAILED the requirements for a valid MOT with 6 comments.

Recorded mileage: 70,701

Recorded mileage: 70,701


FAIL


MOT TEST: 21 March 2008 12:45:30 PASSED
MOT TEST: 21 March 2008 12:45:30 PASSED

This test (322541588091) was completed on the 21 March 2008 12:45:30 and PASSED the requirements for a valid MOT with 1 comments.

This test (322541588091) was completed on the 21 March 2008 12:45:30 and PASSED the requirements for a valid MOT with 1 comments.

Recorded mileage: 66,076

Recorded mileage: 66,076


ADVISORY


MOT TEST: 15 March 2008 11:39:53 FAILED
MOT TEST: 15 March 2008 11:39:53 FAILED

This test (584855978014) was completed on the 15 March 2008 11:39:53 and FAILED the requirements for a valid MOT with 4 comments.

This test (584855978014) was completed on the 15 March 2008 11:39:53 and FAILED the requirements for a valid MOT with 4 comments.

Recorded mileage: 65,962

Recorded mileage: 65,962


ADVISORY

FAIL


MOT TEST: 17 March 2007 10:46:20 PASSED
MOT TEST: 17 March 2007 10:46:20 PASSED

This test (174736877495) was completed on the 17 March 2007 10:46:20 and PASSED the requirements for a valid MOT with 1 comments.

This test (174736877495) was completed on the 17 March 2007 10:46:20 and PASSED the requirements for a valid MOT with 1 comments.

Recorded mileage: 61,401

Recorded mileage: 61,401


USER ENTERED


MOT TEST: 18 March 2006 10:30:47 PASSED
MOT TEST: 18 March 2006 10:30:47 PASSED

This test (231517476017) was completed on the 18 March 2006 10:30:47 and PASSED the requirements for a valid MOT with 0 comments.

This test (231517476017) was completed on the 18 March 2006 10:30:47 and PASSED the requirements for a valid MOT with 0 comments.

Recorded mileage: 57,137

Recorded mileage: 57,137