JCM 431F


JCM431F is registered to a Blue 1968, Morris with a Petrol engine. It Failed its most recent MOT Test on the 29 June 2007

14 unique faults (14 Total) reported in its MOT History (2 Tests).

0 common/recurring faults.

50% (1) MOT Pass Rate and a 50% (1) MOT Failure Rate.

92,164 recorded miles.

JCM 431F


JCM431F is registered to a Blue 1968, Morris with a Petrol engine. It Failed its most recent MOT Test on the 29 June 2007

14 unique faults (14 Total) reported in its MOT History (2 Tests).

0 common/recurring faults.

50% (1) MOT Pass Rate and a 50% (1) MOT Failure Rate.

92,164 recorded miles.

MOT PASS/Failure rate for JCM 431F

all MOT test results for JCM 431F represented as a percentage
MOT PASS/Failure rate for JCM 431F
all MOT test results for JCM 431F represented as a percentage

PERCENTAGE OF VEHICLE FAULTS WITH JCM 431F

ALL REPORTED FAULTS, DISPLAYED BY PERCENTAGE OF OCCURRENCE DURING ALL MOT TESTS
PERCENTAGE OF VEHICLE FAULTS WITH JCM 431F
ALL REPORTED FAULTS, DISPLAYED BY PERCENTAGE OF OCCURRENCE DURING ALL MOT TESTS
FAIL

JCM 431F annual Faults by type

ALL REPORTED FAULTS, DISPLAYED over time and categorised by type
JCM 431F annual Faults by type
ALL REPORTED FAULTS, DISPLAYED over time and categorised by type

ALL JCM 431F Failure Faults [14]

ALL Failure faults, ORDERED by OCCURRENCE DURING JCM 431F's MOT HISTORY
ALL JCM 431F Failure Faults [14]
ALL Failure faults, ORDERED by OCCURRENCE DURING JCM 431F's MOT HISTORY
Fail Faults | source www.vehiclestats.co.uk
Fault Fault Test Date Test Date/Time Reference MOT Test Reference
1 Windscreen wiper not operating automatically when switched on (8.2.1b) Windscreen wiper not operating automatically when switched on (8.2.1b) 25 May 2007 [19:49] 25/05/2007 704145447101 704145447101
1 Windscreen washer provides insufficient washer liquid (8.2.3) Windscreen washer provides insufficient washer liquid (8.2.3) 25 May 2007 [19:49] 25/05/2007 704145447101 704145447101
1 Nearside front position lamp(s) not working (1.1.a.3b) Nearside front position lamp(s) not working (1.1.a.3b) 25 May 2007 [19:49] 25/05/2007 704145447101 704145447101
1 Nearside headlamp aim too low (1.8) Nearside headlamp aim too low (1.8) 25 May 2007 [19:49] 25/05/2007 704145447101 704145447101
1 Registration plate lamp not working (1.1.c.1d) Registration plate lamp not working (1.1.c.1d) 25 May 2007 [19:49] 25/05/2007 704145447101 704145447101
1 Stop lamp not working (1.2.1b) Stop lamp not working (1.2.1b) 25 May 2007 [19:49] 25/05/2007 704145447101 704145447101
1 Direction indicators not working (1.4.a.2c) Direction indicators not working (1.4.a.2c) 25 May 2007 [19:49] 25/05/2007 704145447101 704145447101
1 Indicator tell tale inoperative (1.4.a.2a) Indicator tell tale inoperative (1.4.a.2a) 25 May 2007 [19:49] 25/05/2007 704145447101 704145447101
1 Steering wheel retaining device insecure (2.1.6) Steering wheel retaining device insecure (2.1.6) 25 May 2007 [19:49] 25/05/2007 704145447101 704145447101
1 Nearside front brake hose excessively deteriorated (3.6.b.4d) Nearside front brake hose excessively deteriorated (3.6.b.4d) 25 May 2007 [19:49] 25/05/2007 704145447101 704145447101
1 Offside front brake hose excessively deteriorated (3.6.b.4d) Offside front brake hose excessively deteriorated (3.6.b.4d) 25 May 2007 [19:49] 25/05/2007 704145447101 704145447101
1 Offside rear rear brake binding (3.7.b.1) Offside rear rear brake binding (3.7.b.1) 25 May 2007 [19:49] 25/05/2007 704145447101 704145447101
1 Nearside rear suspension spring mounting prescribed area is excessively corroded (2.4.a.3) Nearside rear suspension spring mounting prescribed area is excessively corroded (2.4.a.3) 25 May 2007 [19:49] 25/05/2007 704145447101 704145447101
1 Offside rear rear brake recording little or no effort (3.7.b.5a) Offside rear rear brake recording little or no effort (3.7.b.5a) 25 May 2007 [19:49] 25/05/2007 704145447101 704145447101

MOT TEST: 29 June 2007 16:24:00 PASSED
MOT TEST: 29 June 2007 16:24:00 PASSED

This test (572220587130) was completed on the 29 June 2007 16:24:00 and PASSED the requirements for a valid MOT with 0 comments.

This test (572220587130) was completed on the 29 June 2007 16:24:00 and PASSED the requirements for a valid MOT with 0 comments.

Recorded mileage: 92,164

Recorded mileage: 92,164


MOT TEST: 25 May 2007 19:49:16 FAILED
MOT TEST: 25 May 2007 19:49:16 FAILED

This test (704145447101) was completed on the 25 May 2007 19:49:16 and FAILED the requirements for a valid MOT with 14 comments.

This test (704145447101) was completed on the 25 May 2007 19:49:16 and FAILED the requirements for a valid MOT with 14 comments.

Recorded mileage: 92,157

Recorded mileage: 92,157


FAIL