JCM 863F


JCM863F is registered to a Blue 1968, Morris Minor with a Petrol engine. It Failed its most recent MOT Test on the 08 November 2010

22 unique faults (23 Total) reported in its MOT History (8 Tests).

1 common/recurring faults.

50% (4) MOT Pass Rate and a 50% (4) MOT Failure Rate.

55,681 recorded miles.

JCM 863F


JCM863F is registered to a Blue 1968, Morris Minor with a Petrol engine. It Failed its most recent MOT Test on the 08 November 2010

22 unique faults (23 Total) reported in its MOT History (8 Tests).

1 common/recurring faults.

50% (4) MOT Pass Rate and a 50% (4) MOT Failure Rate.

55,681 recorded miles.

MOT PASS/Failure rate for JCM 863F

all MOT test results for JCM 863F represented as a percentage
MOT PASS/Failure rate for JCM 863F
all MOT test results for JCM 863F represented as a percentage

PERCENTAGE OF VEHICLE FAULTS WITH JCM 863F

ALL REPORTED FAULTS, DISPLAYED BY PERCENTAGE OF OCCURRENCE DURING ALL MOT TESTS
PERCENTAGE OF VEHICLE FAULTS WITH JCM 863F
ALL REPORTED FAULTS, DISPLAYED BY PERCENTAGE OF OCCURRENCE DURING ALL MOT TESTS
ADVISORY

FAIL

USER ENTERED

JCM 863F annual Faults by type

ALL REPORTED FAULTS, DISPLAYED over time and categorised by type
JCM 863F annual Faults by type
ALL REPORTED FAULTS, DISPLAYED over time and categorised by type

ALL JCM 863F ADVISORIES [2]

ALL ADVISORIES, ORDERED by OCCURRENCE DURING JCM 863F's MOT HISTORY
ALL JCM 863F ADVISORIES [2]
ALL ADVISORIES, ORDERED by OCCURRENCE DURING JCM 863F's MOT HISTORY
Advisory Faults | source www.vehiclestats.co.uk
Fault Fault Test Date Test Date/Time Reference MOT Test Reference
2 Steering column shaft has slight end float (2.1.3) Steering column shaft has slight end float (2.1.3) 20 November 2008 [12:46] 20/11/2008 13 November 2008 [12:39] 13/11/2008 763295828394 763295828394 724138518371 724138518371

ALL JCM 863F Failure Faults [20]

ALL Failure faults, ORDERED by OCCURRENCE DURING JCM 863F's MOT HISTORY
ALL JCM 863F Failure Faults [20]
ALL Failure faults, ORDERED by OCCURRENCE DURING JCM 863F's MOT HISTORY
Fail Faults | source www.vehiclestats.co.uk
Fault Fault Test Date Test Date/Time Reference MOT Test Reference
1 Offside front suspension component mounting prescribed area is excessively corroded (2.4.a.3) Offside front suspension component mounting prescribed area is excessively corroded (2.4.a.3) 01 November 2010 [10:41] 01/11/2010 923085500394 923085500394
1 Offside suspension component mounting prescribed area is excessively corroded (2.4.a.3) Offside suspension component mounting prescribed area is excessively corroded (2.4.a.3) 01 November 2010 [10:41] 01/11/2010 923085500394 923085500394
1 Nearside rear suspension component mounting prescribed area is excessively corroded (2.4.a.3) Nearside rear suspension component mounting prescribed area is excessively corroded (2.4.a.3) 01 November 2010 [10:41] 01/11/2010 923085500394 923085500394
1 Nearside headlamp excessively deteriorated so that the light output is severely reduced (1.7.5a) Nearside headlamp excessively deteriorated so that the light output is severely reduced (1.7.5a) 01 November 2010 [10:41] 01/11/2010 923085500394 923085500394
1 Nearside front wheel bearing has excessive play (2.5.a.3c) Nearside front wheel bearing has excessive play (2.5.a.3c) 01 November 2010 [10:41] 01/11/2010 923085500394 923085500394
1 Nearside rear brake recording little or no effort (3.7.b.5a) Nearside rear brake recording little or no effort (3.7.b.5a) 01 November 2010 [10:41] 01/11/2010 923085500394 923085500394
1 Offside rear brake recording little or no effort (3.7.b.5a) Offside rear brake recording little or no effort (3.7.b.5a) 01 November 2010 [10:41] 01/11/2010 923085500394 923085500394
1 Nearside rear parking brake recording little or no effort (3.7.b.6a) Nearside rear parking brake recording little or no effort (3.7.b.6a) 01 November 2010 [10:41] 01/11/2010 923085500394 923085500394
1 Offside rear parking brake recording little or no effort (3.7.b.6a) Offside rear parking brake recording little or no effort (3.7.b.6a) 01 November 2010 [10:41] 01/11/2010 923085500394 923085500394
1 Service brake: efficiency below requirements (3.7.b.7) Service brake: efficiency below requirements (3.7.b.7) 01 November 2010 [10:41] 01/11/2010 923085500394 923085500394
1 Parking brake: efficiency below requirements (3.7.b.7) Parking brake: efficiency below requirements (3.7.b.7) 01 November 2010 [10:41] 01/11/2010 923085500394 923085500394
1 Nearside rear suspension spring mounting prescribed area is excessively corroded (2.4.a.3) Nearside rear suspension spring mounting prescribed area is excessively corroded (2.4.a.3) 03 November 2009 [10:50] 03/11/2009 311807109318 311807109318
1 Offside headlamp not working on dipped beam (1.7.5a) Offside headlamp not working on dipped beam (1.7.5a) 13 November 2008 [12:39] 13/11/2008 724138518371 724138518371
1 Offside headlamp not working on main beam (1.7.5a) Offside headlamp not working on main beam (1.7.5a) 13 November 2008 [12:39] 13/11/2008 724138518371 724138518371
1 Nearside front suspension component mounting prescribed area is excessively corroded (2.4.a.3) Nearside front suspension component mounting prescribed area is excessively corroded (2.4.a.3) 13 November 2008 [12:39] 13/11/2008 724138518371 724138518371
1 Offside front front position lamp(s) not working (1.1.a.3b) Offside front front position lamp(s) not working (1.1.a.3b) 23 October 2007 [13:03] 23/10/2007 303986097234 303986097234
1 Nearside front headlamp not working on main beam (1.7.5a) Nearside front headlamp not working on main beam (1.7.5a) 23 October 2007 [13:03] 23/10/2007 303986097234 303986097234
1 Nearside rear rear brake recording little or no effort (3.7.b.5a) Nearside rear rear brake recording little or no effort (3.7.b.5a) 23 October 2007 [13:03] 23/10/2007 303986097234 303986097234
1 Nearside rear rear parking brake recording little or no effort (3.7.b.6a) Nearside rear rear parking brake recording little or no effort (3.7.b.6a) 23 October 2007 [13:03] 23/10/2007 303986097234 303986097234
1 Nearside front braking system leaking (3.6.a.1) Nearside front braking system leaking (3.6.a.1) 23 October 2007 [13:03] 23/10/2007 303986097234 303986097234

ALL JCM 863F User Entered Faults [1]

ALL User Entered faults, ORDERED by OCCURRENCE DURING JCM 863F's MOT HISTORY
ALL JCM 863F User Entered Faults [1]
ALL User Entered faults, ORDERED by OCCURRENCE DURING JCM 863F's MOT HISTORY
Fail Faults | source www.vehiclestats.co.uk
Fault Fault Test Date Test Date/Time Reference MOT Test Reference
1 Osf tyrte inner edgde worn and perished os front chassis corroded Osf tyrte inner edgde worn and perished os front chassis corroded 23 October 2007 [13:03] 23/10/2007 303986097234 303986097234

MOT TEST: 08 November 2010 13:58:48 PASSED
MOT TEST: 08 November 2010 13:58:48 PASSED

This test (652712010307) was completed on the 08 November 2010 13:58:48 and PASSED the requirements for a valid MOT with 0 comments.

This test (652712010307) was completed on the 08 November 2010 13:58:48 and PASSED the requirements for a valid MOT with 0 comments.

Recorded mileage: 55,681

Recorded mileage: 55,681


MOT TEST: 01 November 2010 10:41:48 FAILED
MOT TEST: 01 November 2010 10:41:48 FAILED

This test (923085500394) was completed on the 01 November 2010 10:41:48 and FAILED the requirements for a valid MOT with 11 comments.

This test (923085500394) was completed on the 01 November 2010 10:41:48 and FAILED the requirements for a valid MOT with 11 comments.

Recorded mileage: 55,642

Recorded mileage: 55,642


FAIL


MOT TEST: 03 November 2009 13:49:45 PASSED
MOT TEST: 03 November 2009 13:49:45 PASSED

This test (952187609300) was completed on the 03 November 2009 13:49:45 and PASSED the requirements for a valid MOT with 0 comments.

This test (952187609300) was completed on the 03 November 2009 13:49:45 and PASSED the requirements for a valid MOT with 0 comments.

Recorded mileage: 51,894

Recorded mileage: 51,894


MOT TEST: 03 November 2009 10:50:53 FAILED
MOT TEST: 03 November 2009 10:50:53 FAILED

This test (311807109318) was completed on the 03 November 2009 10:50:53 and FAILED the requirements for a valid MOT with 1 comments.

This test (311807109318) was completed on the 03 November 2009 10:50:53 and FAILED the requirements for a valid MOT with 1 comments.

Recorded mileage: 51,894

Recorded mileage: 51,894


FAIL


MOT TEST: 20 November 2008 12:46:57 PASSED
MOT TEST: 20 November 2008 12:46:57 PASSED

This test (763295828394) was completed on the 20 November 2008 12:46:57 and PASSED the requirements for a valid MOT with 1 comments.

This test (763295828394) was completed on the 20 November 2008 12:46:57 and PASSED the requirements for a valid MOT with 1 comments.

Recorded mileage: 49,236

Recorded mileage: 49,236


ADVISORY


MOT TEST: 13 November 2008 12:39:50 FAILED
MOT TEST: 13 November 2008 12:39:50 FAILED

This test (724138518371) was completed on the 13 November 2008 12:39:50 and FAILED the requirements for a valid MOT with 4 comments.

This test (724138518371) was completed on the 13 November 2008 12:39:50 and FAILED the requirements for a valid MOT with 4 comments.

Recorded mileage: 49,233

Recorded mileage: 49,233


ADVISORY

FAIL


MOT TEST: 30 October 2007 15:23:15 PASSED
MOT TEST: 30 October 2007 15:23:15 PASSED

This test (381043407349) was completed on the 30 October 2007 15:23:15 and PASSED the requirements for a valid MOT with 0 comments.

This test (381043407349) was completed on the 30 October 2007 15:23:15 and PASSED the requirements for a valid MOT with 0 comments.

Recorded mileage: 48,299

Recorded mileage: 48,299


MOT TEST: 23 October 2007 13:03:11 FAILED
MOT TEST: 23 October 2007 13:03:11 FAILED

This test (303986097234) was completed on the 23 October 2007 13:03:11 and FAILED the requirements for a valid MOT with 6 comments.

This test (303986097234) was completed on the 23 October 2007 13:03:11 and FAILED the requirements for a valid MOT with 6 comments.

Recorded mileage: 48,299

Recorded mileage: 48,299


FAIL

USER ENTERED