JCO 632F


JCO632F is registered to a Blue 1968, Morris Minor 1000 with a Petrol engine. It Failed its most recent MOT Test on the 20 June 2017

5 unique faults (5 Total) reported in its MOT History (9 Tests).

0 common/recurring faults.

78% (7) MOT Pass Rate and a 22% (2) MOT Failure Rate.

79,131 recorded miles.

JCO 632F


JCO632F is registered to a Blue 1968, Morris Minor 1000 with a Petrol engine. It Failed its most recent MOT Test on the 20 June 2017

5 unique faults (5 Total) reported in its MOT History (9 Tests).

0 common/recurring faults.

78% (7) MOT Pass Rate and a 22% (2) MOT Failure Rate.

79,131 recorded miles.

MOT PASS/Failure rate for JCO 632F

all MOT test results for JCO 632F represented as a percentage
MOT PASS/Failure rate for JCO 632F
all MOT test results for JCO 632F represented as a percentage

PERCENTAGE OF VEHICLE FAULTS WITH JCO 632F

ALL REPORTED FAULTS, DISPLAYED BY PERCENTAGE OF OCCURRENCE DURING ALL MOT TESTS
PERCENTAGE OF VEHICLE FAULTS WITH JCO 632F
ALL REPORTED FAULTS, DISPLAYED BY PERCENTAGE OF OCCURRENCE DURING ALL MOT TESTS
ADVISORY

FAIL

PASS WITH RECTIFICATION

JCO 632F annual Faults by type

ALL REPORTED FAULTS, DISPLAYED over time and categorised by type
JCO 632F annual Faults by type
ALL REPORTED FAULTS, DISPLAYED over time and categorised by type

ALL JCO 632F ADVISORIES [2]

ALL ADVISORIES, ORDERED by OCCURRENCE DURING JCO 632F's MOT HISTORY
ALL JCO 632F ADVISORIES [2]
ALL ADVISORIES, ORDERED by OCCURRENCE DURING JCO 632F's MOT HISTORY
Advisory Faults | source www.vehiclestats.co.uk
Fault Fault Test Date Test Date/Time Reference MOT Test Reference
1 Nearside steering rack gaiter deteriorated (2.2.d.2d) Nearside steering rack gaiter deteriorated (2.2.d.2d) 24 April 2013 [14:39] 24/04/2013 155904513160 155904513160
1 Offside steering rack gaiter deteriorated (2.2.d.2d) Offside steering rack gaiter deteriorated (2.2.d.2d) 24 April 2013 [14:39] 24/04/2013 155904513160 155904513160

ALL JCO 632F Failure Faults [2]

ALL Failure faults, ORDERED by OCCURRENCE DURING JCO 632F's MOT HISTORY
ALL JCO 632F Failure Faults [2]
ALL Failure faults, ORDERED by OCCURRENCE DURING JCO 632F's MOT HISTORY
Fail Faults | source www.vehiclestats.co.uk
Fault Fault Test Date Test Date/Time Reference MOT Test Reference
1 Nearside steering rack gaiter split (2.2.d.2d) Nearside steering rack gaiter split (2.2.d.2d) 06 May 2014 [15:00] 06/05/2014 418796124163 418796124163
1 Offside steering rack gaiter split (2.2.d.2d) Offside steering rack gaiter split (2.2.d.2d) 06 May 2014 [15:00] 06/05/2014 418796124163 418796124163

ALL JCO 632F Pass With Rectification Faults [1]

ALL Pass With Rectification faults, ORDERED by OCCURRENCE DURING JCO 632F's MOT HISTORY
ALL JCO 632F Pass With Rectification Faults [1]
ALL Pass With Rectification faults, ORDERED by OCCURRENCE DURING JCO 632F's MOT HISTORY
Pass With Rectification Faults | source www.vehiclestats.co.uk
Fault Fault Test Date Test Date/Time Reference MOT Test Reference
1 Offside headlamp not working on dipped beam (1.7.5a) Offside headlamp not working on dipped beam (1.7.5a) 20 June 2017 [13:12] 20/06/2017 803357203469 803357203469

MOT TEST: 20 June 2017 13:12:16 PASSED
MOT TEST: 20 June 2017 13:12:16 PASSED

This test (853864292559) was completed on the 20 June 2017 13:12:16 and PASSED the requirements for a valid MOT with 0 comments.

This test (853864292559) was completed on the 20 June 2017 13:12:16 and PASSED the requirements for a valid MOT with 0 comments.

Recorded mileage: 79,131

Recorded mileage: 79,131


MOT TEST: 20 June 2017 13:12:15 FAILED
MOT TEST: 20 June 2017 13:12:15 FAILED

This test (803357203469) was completed on the 20 June 2017 13:12:15 and FAILED the requirements for a valid MOT with 1 comments.

This test (803357203469) was completed on the 20 June 2017 13:12:15 and FAILED the requirements for a valid MOT with 1 comments.

Recorded mileage: 79,131

Recorded mileage: 79,131


PASS WITH RECTIFICATION


MOT TEST: 21 October 2015 13:25:55 PASSED
MOT TEST: 21 October 2015 13:25:55 PASSED

This test (601990226799) was completed on the 21 October 2015 13:25:55 and PASSED the requirements for a valid MOT with 0 comments.

This test (601990226799) was completed on the 21 October 2015 13:25:55 and PASSED the requirements for a valid MOT with 0 comments.

Recorded mileage: 79,111

Recorded mileage: 79,111


MOT TEST: 08 May 2014 07:53:40 PASSED
MOT TEST: 08 May 2014 07:53:40 PASSED

This test (575288624180) was completed on the 08 May 2014 07:53:40 and PASSED the requirements for a valid MOT with 0 comments.

This test (575288624180) was completed on the 08 May 2014 07:53:40 and PASSED the requirements for a valid MOT with 0 comments.

Recorded mileage: 79,076

Recorded mileage: 79,076


MOT TEST: 06 May 2014 15:00:33 FAILED
MOT TEST: 06 May 2014 15:00:33 FAILED

This test (418796124163) was completed on the 06 May 2014 15:00:33 and FAILED the requirements for a valid MOT with 2 comments.

This test (418796124163) was completed on the 06 May 2014 15:00:33 and FAILED the requirements for a valid MOT with 2 comments.

Recorded mileage: 79,076

Recorded mileage: 79,076


FAIL


MOT TEST: 24 April 2013 14:39:39 PASSED
MOT TEST: 24 April 2013 14:39:39 PASSED

This test (155904513160) was completed on the 24 April 2013 14:39:39 and PASSED the requirements for a valid MOT with 2 comments.

This test (155904513160) was completed on the 24 April 2013 14:39:39 and PASSED the requirements for a valid MOT with 2 comments.

Recorded mileage: 79,002

Recorded mileage: 79,002


ADVISORY


MOT TEST: 24 April 2012 16:09:54 PASSED
MOT TEST: 24 April 2012 16:09:54 PASSED

This test (729475612102) was completed on the 24 April 2012 16:09:54 and PASSED the requirements for a valid MOT with 0 comments.

This test (729475612102) was completed on the 24 April 2012 16:09:54 and PASSED the requirements for a valid MOT with 0 comments.

Recorded mileage: 78,982

Recorded mileage: 78,982


MOT TEST: 26 May 2010 15:53:46 PASSED
MOT TEST: 26 May 2010 15:53:46 PASSED

This test (243556240182) was completed on the 26 May 2010 15:53:46 and PASSED the requirements for a valid MOT with 0 comments.

This test (243556240182) was completed on the 26 May 2010 15:53:46 and PASSED the requirements for a valid MOT with 0 comments.

Recorded mileage: 78,937

Recorded mileage: 78,937


MOT TEST: 20 May 2009 11:42:27 PASSED
MOT TEST: 20 May 2009 11:42:27 PASSED

This test (961420649122) was completed on the 20 May 2009 11:42:27 and PASSED the requirements for a valid MOT with 0 comments.

This test (961420649122) was completed on the 20 May 2009 11:42:27 and PASSED the requirements for a valid MOT with 0 comments.

Recorded mileage: 78,873

Recorded mileage: 78,873