JCO 647F


JCO647F is registered to a Maroon 1968, Morris Minor 1000 with a Petrol engine. It Failed its most recent MOT Test on the 06 April 2016

13 unique faults (16 Total) reported in its MOT History (9 Tests).

2 common/recurring faults, the most frequent (3 times) is: Rear Exhaust has a minor leak of exhaust gases (7.1.2).

78% (7) MOT Pass Rate and a 22% (2) MOT Failure Rate.

64,420 recorded miles.

JCO 647F


JCO647F is registered to a Maroon 1968, Morris Minor 1000 with a Petrol engine. It Failed its most recent MOT Test on the 06 April 2016

13 unique faults (16 Total) reported in its MOT History (9 Tests).

2 common/recurring faults, the most frequent (3 times) is: Rear Exhaust has a minor leak of exhaust gases (7.1.2).

78% (7) MOT Pass Rate and a 22% (2) MOT Failure Rate.

64,420 recorded miles.

MOT PASS/Failure rate for JCO 647F

all MOT test results for JCO 647F represented as a percentage
MOT PASS/Failure rate for JCO 647F
all MOT test results for JCO 647F represented as a percentage

PERCENTAGE OF VEHICLE FAULTS WITH JCO 647F

ALL REPORTED FAULTS, DISPLAYED BY PERCENTAGE OF OCCURRENCE DURING ALL MOT TESTS
PERCENTAGE OF VEHICLE FAULTS WITH JCO 647F
ALL REPORTED FAULTS, DISPLAYED BY PERCENTAGE OF OCCURRENCE DURING ALL MOT TESTS
ADVISORY

FAIL

USER ENTERED

PASS WITH RECTIFICATION

JCO 647F annual Faults by type

ALL REPORTED FAULTS, DISPLAYED over time and categorised by type
JCO 647F annual Faults by type
ALL REPORTED FAULTS, DISPLAYED over time and categorised by type

RECURRING FAULTS WITH JCO 647F

FAULTS THAT HAVE OCCURED MORE THAN ONCE DURING JCO 647F's MOT HISTORY
RECURRING FAULTS WITH JCO 647F
FAULTS THAT HAVE OCCURED MORE THAN ONCE DURING JCO 647F's MOT HISTORY
Fault Fault Test Date Test Date/Time Reference MOT Test Reference
3 Rear exhaust has a minor leak of exhaust gases (7.1.2) Rear exhaust has a minor leak of exhaust gases (7.1.2) 05 March 2012 [11:06] 05/03/2012 05 March 2012 [11:06] 05/03/2012 26 February 2010 [10:47] 26/02/2010 906675662038 906675662038 398655362012 398655362012 513587350029 513587350029
2 Nearside rear upper suspension component mounting prescribed area is corroded but not considered excessive (2.4.a.3) Nearside rear upper suspension component mounting prescribed area is corroded but not considered excessive (2.4.a.3) 26 February 2010 [10:47] 26/02/2010 05 March 2009 [11:15] 05/03/2009 513587350029 513587350029 901434169067 901434169067

ALL JCO 647F ADVISORIES [11]

ALL ADVISORIES, ORDERED by OCCURRENCE DURING JCO 647F's MOT HISTORY
ALL JCO 647F ADVISORIES [11]
ALL ADVISORIES, ORDERED by OCCURRENCE DURING JCO 647F's MOT HISTORY
Advisory Faults | source www.vehiclestats.co.uk
Fault Fault Test Date Test Date/Time Reference MOT Test Reference
3 Rear exhaust has a minor leak of exhaust gases (7.1.2) Rear exhaust has a minor leak of exhaust gases (7.1.2) 05 March 2012 [11:06] 05/03/2012 05 March 2012 [11:06] 05/03/2012 26 February 2010 [10:47] 26/02/2010 906675662038 906675662038 398655362012 398655362012 513587350029 513587350029
2 Nearside rear upper suspension component mounting prescribed area is corroded but not considered excessive (2.4.a.3) Nearside rear upper suspension component mounting prescribed area is corroded but not considered excessive (2.4.a.3) 26 February 2010 [10:47] 26/02/2010 05 March 2009 [11:15] 05/03/2009 513587350029 513587350029 901434169067 901434169067
1 Slight bind nearside front Slight bind nearside front 06 April 2016 [15:56] 06/04/2016 200358681973 200358681973
1 Front brakes imbalanced requirements only just met. It would appear that the braking system requires adjustment or repair. (3.7.b.5b) Front brakes imbalanced requirements only just met. It would appear that the braking system requires adjustment or repair. (3.7.b.5b) 06 April 2016 [15:56] 06/04/2016 200358681973 200358681973
1 Front exhaust has a minor leak of exhaust gases (7.1.2) Front exhaust has a minor leak of exhaust gases (7.1.2) 28 March 2014 [10:38] 28/03/2014 575367884085 575367884085
1 Nearside rear suspension component mounting prescribed area is corroded but not considered excessive (2.4.a.3) Nearside rear suspension component mounting prescribed area is corroded but not considered excessive (2.4.a.3) 28 March 2014 [10:38] 28/03/2014 575367884085 575367884085
1 Nearside track rod end ball joint has slight play (2.2.b.1f) Nearside track rod end ball joint has slight play (2.2.b.1f) 11 March 2011 [10:29] 11/03/2011 985320671003 985320671003
1 Offside rear upper suspension component mounting prescribed area is corroded but not considered excessive (2.4.a.3) Offside rear upper suspension component mounting prescribed area is corroded but not considered excessive (2.4.a.3) 05 March 2009 [11:15] 05/03/2009 901434169067 901434169067

ALL JCO 647F Failure Faults [2]

ALL Failure faults, ORDERED by OCCURRENCE DURING JCO 647F's MOT HISTORY
ALL JCO 647F Failure Faults [2]
ALL Failure faults, ORDERED by OCCURRENCE DURING JCO 647F's MOT HISTORY
Advisory Faults | source www.vehiclestats.co.uk
Fault Fault Test Date Test Date/Time Reference MOT Test Reference
1 Nearside front suspension component mounting prescribed area is excessively corroded lower chassis leg (2.4.a.3) Nearside front suspension component mounting prescribed area is excessively corroded lower chassis leg (2.4.a.3) 06 April 2016 [15:56] 06/04/2016 200358681973 200358681973
1 Nearside rear suspension spring mounting prescribed area is excessively corroded floor and sill including inner sill (2.4.a.3) Nearside rear suspension spring mounting prescribed area is excessively corroded floor and sill including inner sill (2.4.a.3) 06 April 2016 [15:56] 06/04/2016 200358681973 200358681973

ALL JCO 647F User Entered Faults [1]

ALL User Entered faults, ORDERED by OCCURRENCE DURING JCO 647F's MOT HISTORY
ALL JCO 647F User Entered Faults [1]
ALL User Entered faults, ORDERED by OCCURRENCE DURING JCO 647F's MOT HISTORY
Advisory Faults | source www.vehiclestats.co.uk
Fault Fault Test Date Test Date/Time Reference MOT Test Reference
1 Brake pedal,long travel. Brake pedal,long travel. 28 March 2014 [10:38] 28/03/2014 575367884085 575367884085

ALL JCO 647F Pass With Rectification Faults [2]

ALL Pass With Rectification faults, ORDERED by OCCURRENCE DURING JCO 647F's MOT HISTORY
ALL JCO 647F Pass With Rectification Faults [2]
ALL Pass With Rectification faults, ORDERED by OCCURRENCE DURING JCO 647F's MOT HISTORY
Pass With Rectification Faults | source www.vehiclestats.co.uk
Fault Fault Test Date Test Date/Time Reference MOT Test Reference
1 Nearside headlamp aim too high (1.8) Nearside headlamp aim too high (1.8) 05 March 2012 [11:06] 05/03/2012 398655362012 398655362012
1 Offside headlamp aim too high (1.8) Offside headlamp aim too high (1.8) 05 March 2012 [11:06] 05/03/2012 398655362012 398655362012

MOT TEST: 06 April 2016 15:56:39 FAILED
MOT TEST: 06 April 2016 15:56:39 FAILED

This test (200358681973) was completed on the 06 April 2016 15:56:39 and FAILED the requirements for a valid MOT with 4 comments.

This test (200358681973) was completed on the 06 April 2016 15:56:39 and FAILED the requirements for a valid MOT with 4 comments.

Recorded mileage: 64,420

Recorded mileage: 64,420


ADVISORY

FAIL


MOT TEST: 02 March 2015 16:03:32 PASSED
MOT TEST: 02 March 2015 16:03:32 PASSED

This test (288481765085) was completed on the 02 March 2015 16:03:32 and PASSED the requirements for a valid MOT with 0 comments.

This test (288481765085) was completed on the 02 March 2015 16:03:32 and PASSED the requirements for a valid MOT with 0 comments.

Recorded mileage: 63,324

Recorded mileage: 63,324


MOT TEST: 28 March 2014 10:38:55 PASSED
MOT TEST: 28 March 2014 10:38:55 PASSED

This test (575367884085) was completed on the 28 March 2014 10:38:55 and PASSED the requirements for a valid MOT with 3 comments.

This test (575367884085) was completed on the 28 March 2014 10:38:55 and PASSED the requirements for a valid MOT with 3 comments.

Recorded mileage: 63,082

Recorded mileage: 63,082


ADVISORY

USER ENTERED


MOT TEST: 07 March 2013 11:57:00 PASSED
MOT TEST: 07 March 2013 11:57:00 PASSED

This test (765146763094) was completed on the 07 March 2013 11:57:00 and PASSED the requirements for a valid MOT with 0 comments.

This test (765146763094) was completed on the 07 March 2013 11:57:00 and PASSED the requirements for a valid MOT with 0 comments.

Recorded mileage: 62,931

Recorded mileage: 62,931


MOT TEST: 05 March 2012 11:06:46 PASSED
MOT TEST: 05 March 2012 11:06:46 PASSED

This test (906675662038) was completed on the 05 March 2012 11:06:46 and PASSED the requirements for a valid MOT with 1 comments.

This test (906675662038) was completed on the 05 March 2012 11:06:46 and PASSED the requirements for a valid MOT with 1 comments.

Recorded mileage: 62,674

Recorded mileage: 62,674


ADVISORY


MOT TEST: 05 March 2012 11:06:46 FAILED
MOT TEST: 05 March 2012 11:06:46 FAILED

This test (398655362012) was completed on the 05 March 2012 11:06:46 and FAILED the requirements for a valid MOT with 3 comments.

This test (398655362012) was completed on the 05 March 2012 11:06:46 and FAILED the requirements for a valid MOT with 3 comments.

Recorded mileage: 62,674

Recorded mileage: 62,674


ADVISORY

PASS WITH RECTIFICATION


MOT TEST: 11 March 2011 10:29:36 PASSED
MOT TEST: 11 March 2011 10:29:36 PASSED

This test (985320671003) was completed on the 11 March 2011 10:29:36 and PASSED the requirements for a valid MOT with 1 comments.

This test (985320671003) was completed on the 11 March 2011 10:29:36 and PASSED the requirements for a valid MOT with 1 comments.

Recorded mileage: 62,392

Recorded mileage: 62,392


ADVISORY


MOT TEST: 26 February 2010 10:47:22 PASSED
MOT TEST: 26 February 2010 10:47:22 PASSED

This test (513587350029) was completed on the 26 February 2010 10:47:22 and PASSED the requirements for a valid MOT with 2 comments.

This test (513587350029) was completed on the 26 February 2010 10:47:22 and PASSED the requirements for a valid MOT with 2 comments.

Recorded mileage: 62,047

Recorded mileage: 62,047


ADVISORY


MOT TEST: 05 March 2009 11:15:25 PASSED
MOT TEST: 05 March 2009 11:15:25 PASSED

This test (901434169067) was completed on the 05 March 2009 11:15:25 and PASSED the requirements for a valid MOT with 2 comments.

This test (901434169067) was completed on the 05 March 2009 11:15:25 and PASSED the requirements for a valid MOT with 2 comments.

Recorded mileage: 61,463

Recorded mileage: 61,463


ADVISORY