JCO 740


JCO740 is registered to a Green 1954, Morris Minor with a Petrol engine. It Failed its most recent MOT Test on the 02 October 2012

7 unique faults (7 Total) reported in its MOT History (5 Tests).

0 common/recurring faults.

60% (3) MOT Pass Rate and a 40% (2) MOT Failure Rate.

83,375 recorded miles.

JCO 740


JCO740 is registered to a Green 1954, Morris Minor with a Petrol engine. It Failed its most recent MOT Test on the 02 October 2012

7 unique faults (7 Total) reported in its MOT History (5 Tests).

0 common/recurring faults.

60% (3) MOT Pass Rate and a 40% (2) MOT Failure Rate.

83,375 recorded miles.

MOT PASS/Failure rate for JCO 740

all MOT test results for JCO 740 represented as a percentage
MOT PASS/Failure rate for JCO 740
all MOT test results for JCO 740 represented as a percentage

PERCENTAGE OF VEHICLE FAULTS WITH JCO 740

ALL REPORTED FAULTS, DISPLAYED BY PERCENTAGE OF OCCURRENCE DURING ALL MOT TESTS
PERCENTAGE OF VEHICLE FAULTS WITH JCO 740
ALL REPORTED FAULTS, DISPLAYED BY PERCENTAGE OF OCCURRENCE DURING ALL MOT TESTS
FAIL

USER ENTERED

JCO 740 annual Faults by type

ALL REPORTED FAULTS, DISPLAYED over time and categorised by type
JCO 740 annual Faults by type
ALL REPORTED FAULTS, DISPLAYED over time and categorised by type

ALL JCO 740 Failure Faults [5]

ALL Failure faults, ORDERED by OCCURRENCE DURING JCO 740's MOT HISTORY
ALL JCO 740 Failure Faults [5]
ALL Failure faults, ORDERED by OCCURRENCE DURING JCO 740's MOT HISTORY
Fail Faults | source www.vehiclestats.co.uk
Fault Fault Test Date Test Date/Time Reference MOT Test Reference
1 Nearside rear tyre tread depth below requirements of 1.6mm (4.1.e.1) Nearside rear tyre tread depth below requirements of 1.6mm (4.1.e.1) 21 September 2011 [14:07] 21/09/2011 825814361217 825814361217
1 Offside rear tyre tread depth below requirements of 1.6mm (4.1.e.1) Offside rear tyre tread depth below requirements of 1.6mm (4.1.e.1) 21 September 2011 [14:07] 21/09/2011 825814361217 825814361217
1 Steering column movement between the shaft and steering wheel (2.1.2b) Steering column movement between the shaft and steering wheel (2.1.2b) 25 August 2010 [09:37] 25/08/2010 212407530273 212407530273
1 Offside rear brake drum contaminated by oil (3.5.1h) Offside rear brake drum contaminated by oil (3.5.1h) 25 August 2010 [09:37] 25/08/2010 212407530273 212407530273
1 Nearside rear wheel bearing rough when rotated (2.6.1) Nearside rear wheel bearing rough when rotated (2.6.1) 25 August 2010 [09:37] 25/08/2010 212407530273 212407530273

ALL JCO 740 User Entered Faults [2]

ALL User Entered faults, ORDERED by OCCURRENCE DURING JCO 740's MOT HISTORY
ALL JCO 740 User Entered Faults [2]
ALL User Entered faults, ORDERED by OCCURRENCE DURING JCO 740's MOT HISTORY
User Entered Faults | source www.vehiclestats.co.uk
Fault Fault Test Date Test Date/Time Reference MOT Test Reference
1 Os rear view mirror becoming loose Os rear view mirror becoming loose 11 September 2010 [15:35] 11/09/2010 112174350246 112174350246
1 Offside rear veiw mirror vas movement Offside rear veiw mirror vas movement 25 August 2010 [09:37] 25/08/2010 212407530273 212407530273

MOT TEST: 02 October 2012 13:26:20 PASSED
MOT TEST: 02 October 2012 13:26:20 PASSED

This test (978126172292) was completed on the 02 October 2012 13:26:20 and PASSED the requirements for a valid MOT with 0 comments.

This test (978126172292) was completed on the 02 October 2012 13:26:20 and PASSED the requirements for a valid MOT with 0 comments.

Recorded mileage: 56,426

Recorded mileage: 56,426


MOT TEST: 28 September 2011 13:31:42 PASSED
MOT TEST: 28 September 2011 13:31:42 PASSED

This test (976521371241) was completed on the 28 September 2011 13:31:42 and PASSED the requirements for a valid MOT with 0 comments.

This test (976521371241) was completed on the 28 September 2011 13:31:42 and PASSED the requirements for a valid MOT with 0 comments.

Recorded mileage: 55,923

Recorded mileage: 55,923


MOT TEST: 21 September 2011 14:07:47 FAILED
MOT TEST: 21 September 2011 14:07:47 FAILED

This test (825814361217) was completed on the 21 September 2011 14:07:47 and FAILED the requirements for a valid MOT with 2 comments.

This test (825814361217) was completed on the 21 September 2011 14:07:47 and FAILED the requirements for a valid MOT with 2 comments.

Recorded mileage: 55,838

Recorded mileage: 55,838


FAIL


MOT TEST: 11 September 2010 15:35:06 PASSED
MOT TEST: 11 September 2010 15:35:06 PASSED

This test (112174350246) was completed on the 11 September 2010 15:35:06 and PASSED the requirements for a valid MOT with 1 comments.

This test (112174350246) was completed on the 11 September 2010 15:35:06 and PASSED the requirements for a valid MOT with 1 comments.

Recorded mileage: 83,375

Recorded mileage: 83,375


USER ENTERED


MOT TEST: 25 August 2010 09:37:03 FAILED
MOT TEST: 25 August 2010 09:37:03 FAILED

This test (212407530273) was completed on the 25 August 2010 09:37:03 and FAILED the requirements for a valid MOT with 4 comments.

This test (212407530273) was completed on the 25 August 2010 09:37:03 and FAILED the requirements for a valid MOT with 4 comments.

Recorded mileage: 83,375

Recorded mileage: 83,375


FAIL

USER ENTERED