JCX 423D


JCX423D is registered to a Green 1966, Morris Mini with a Petrol engine. It Failed its most recent MOT Test on the 01 August 2012

6 unique faults (8 Total) reported in its MOT History (9 Tests).

2 common/recurring faults, the most frequent (2 times) is: Nearside Front suspension has slight play in a lower suspension ball joint (2.5.B.1a).

89% (8) MOT Pass Rate and a 11% (1) MOT Failure Rate.

25,317 recorded miles.

JCX 423D


JCX423D is registered to a Green 1966, Morris Mini with a Petrol engine. It Failed its most recent MOT Test on the 01 August 2012

6 unique faults (8 Total) reported in its MOT History (9 Tests).

2 common/recurring faults, the most frequent (2 times) is: Nearside Front suspension has slight play in a lower suspension ball joint (2.5.B.1a).

89% (8) MOT Pass Rate and a 11% (1) MOT Failure Rate.

25,317 recorded miles.

MOT PASS/Failure rate for JCX 423D

all MOT test results for JCX 423D represented as a percentage
MOT PASS/Failure rate for JCX 423D
all MOT test results for JCX 423D represented as a percentage

PERCENTAGE OF VEHICLE FAULTS WITH JCX 423D

ALL REPORTED FAULTS, DISPLAYED BY PERCENTAGE OF OCCURRENCE DURING ALL MOT TESTS
PERCENTAGE OF VEHICLE FAULTS WITH JCX 423D
ALL REPORTED FAULTS, DISPLAYED BY PERCENTAGE OF OCCURRENCE DURING ALL MOT TESTS
ADVISORY

FAIL

JCX 423D annual Faults by type

ALL REPORTED FAULTS, DISPLAYED over time and categorised by type
JCX 423D annual Faults by type
ALL REPORTED FAULTS, DISPLAYED over time and categorised by type

RECURRING FAULTS WITH JCX 423D

FAULTS THAT HAVE OCCURED MORE THAN ONCE DURING JCX 423D's MOT HISTORY
RECURRING FAULTS WITH JCX 423D
FAULTS THAT HAVE OCCURED MORE THAN ONCE DURING JCX 423D's MOT HISTORY
Fault Fault Test Date Test Date/Time Reference MOT Test Reference
2 Nearside front suspension has slight play in a lower suspension ball joint (2.5.b.1a) Nearside front suspension has slight play in a lower suspension ball joint (2.5.b.1a) 12 July 2011 [12:38] 12/07/2011 08 July 2011 [16:11] 08/07/2011 695913291186 695913291186 286079381194 286079381194
2 Nearside front suspension has slight play in a upper suspension ball joint (2.5.b.1a) Nearside front suspension has slight play in a upper suspension ball joint (2.5.b.1a) 12 July 2011 [12:38] 12/07/2011 08 July 2011 [16:11] 08/07/2011 695913291186 695913291186 286079381194 286079381194

ALL JCX 423D ADVISORIES [4]

ALL ADVISORIES, ORDERED by OCCURRENCE DURING JCX 423D's MOT HISTORY
ALL JCX 423D ADVISORIES [4]
ALL ADVISORIES, ORDERED by OCCURRENCE DURING JCX 423D's MOT HISTORY
Advisory Faults | source www.vehiclestats.co.uk
Fault Fault Test Date Test Date/Time Reference MOT Test Reference
2 Nearside front suspension has slight play in a lower suspension ball joint (2.5.b.1a) Nearside front suspension has slight play in a lower suspension ball joint (2.5.b.1a) 12 July 2011 [12:38] 12/07/2011 08 July 2011 [16:11] 08/07/2011 695913291186 695913291186 286079381194 286079381194
2 Nearside front suspension has slight play in a upper suspension ball joint (2.5.b.1a) Nearside front suspension has slight play in a upper suspension ball joint (2.5.b.1a) 12 July 2011 [12:38] 12/07/2011 08 July 2011 [16:11] 08/07/2011 695913291186 695913291186 286079381194 286079381194

ALL JCX 423D Failure Faults [4]

ALL Failure faults, ORDERED by OCCURRENCE DURING JCX 423D's MOT HISTORY
ALL JCX 423D Failure Faults [4]
ALL Failure faults, ORDERED by OCCURRENCE DURING JCX 423D's MOT HISTORY
Fail Faults | source www.vehiclestats.co.uk
Fault Fault Test Date Test Date/Time Reference MOT Test Reference
1 Horn not working (1.6.2a) Horn not working (1.6.2a) 08 July 2011 [16:11] 08/07/2011 286079381194 286079381194
1 Nearside rear brake recording little or no effort (3.7.b.5a) Nearside rear brake recording little or no effort (3.7.b.5a) 08 July 2011 [16:11] 08/07/2011 286079381194 286079381194
1 Offside rear brake recording little or no effort (3.7.b.5a) Offside rear brake recording little or no effort (3.7.b.5a) 08 July 2011 [16:11] 08/07/2011 286079381194 286079381194
1 Service brake: efficiency below requirements (3.7.b.7) Service brake: efficiency below requirements (3.7.b.7) 08 July 2011 [16:11] 08/07/2011 286079381194 286079381194

MOT TEST: 01 August 2012 17:15:31 PASSED
MOT TEST: 01 August 2012 17:15:31 PASSED

This test (368214512480) was completed on the 01 August 2012 17:15:31 and PASSED the requirements for a valid MOT with 0 comments.

This test (368214512480) was completed on the 01 August 2012 17:15:31 and PASSED the requirements for a valid MOT with 0 comments.

Recorded mileage: 25,317

Recorded mileage: 25,317


MOT TEST: 12 July 2011 12:38:44 PASSED
MOT TEST: 12 July 2011 12:38:44 PASSED

This test (695913291186) was completed on the 12 July 2011 12:38:44 and PASSED the requirements for a valid MOT with 2 comments.

This test (695913291186) was completed on the 12 July 2011 12:38:44 and PASSED the requirements for a valid MOT with 2 comments.

Recorded mileage: 25,312

Recorded mileage: 25,312


ADVISORY


MOT TEST: 08 July 2011 16:11:13 FAILED
MOT TEST: 08 July 2011 16:11:13 FAILED

This test (286079381194) was completed on the 08 July 2011 16:11:13 and FAILED the requirements for a valid MOT with 6 comments.

This test (286079381194) was completed on the 08 July 2011 16:11:13 and FAILED the requirements for a valid MOT with 6 comments.

Recorded mileage: 25,299

Recorded mileage: 25,299


ADVISORY

FAIL


MOT TEST: 28 July 2010 14:02:36 PASSED
MOT TEST: 28 July 2010 14:02:36 PASSED

This test (340719400442) was completed on the 28 July 2010 14:02:36 and PASSED the requirements for a valid MOT with 0 comments.

This test (340719400442) was completed on the 28 July 2010 14:02:36 and PASSED the requirements for a valid MOT with 0 comments.

Recorded mileage: 25,296

Recorded mileage: 25,296


MOT TEST: 07 July 2009 12:09:55 PASSED
MOT TEST: 07 July 2009 12:09:55 PASSED

This test (262898589456) was completed on the 07 July 2009 12:09:55 and PASSED the requirements for a valid MOT with 0 comments.

This test (262898589456) was completed on the 07 July 2009 12:09:55 and PASSED the requirements for a valid MOT with 0 comments.

Recorded mileage: 25,227

Recorded mileage: 25,227


MOT TEST: 26 July 2008 10:13:56 PASSED
MOT TEST: 26 July 2008 10:13:56 PASSED

This test (601438908229) was completed on the 26 July 2008 10:13:56 and PASSED the requirements for a valid MOT with 0 comments.

This test (601438908229) was completed on the 26 July 2008 10:13:56 and PASSED the requirements for a valid MOT with 0 comments.

Recorded mileage: 25,202

Recorded mileage: 25,202


MOT TEST: 03 August 2007 16:19:53 PASSED
MOT TEST: 03 August 2007 16:19:53 PASSED

This test (931405517234) was completed on the 03 August 2007 16:19:53 and PASSED the requirements for a valid MOT with 0 comments.

This test (931405517234) was completed on the 03 August 2007 16:19:53 and PASSED the requirements for a valid MOT with 0 comments.

Recorded mileage: 25,065

Recorded mileage: 25,065


MOT TEST: 01 August 2006 13:14:21 PASSED
MOT TEST: 01 August 2006 13:14:21 PASSED

This test (381773116403) was completed on the 01 August 2006 13:14:21 and PASSED the requirements for a valid MOT with 0 comments.

This test (381773116403) was completed on the 01 August 2006 13:14:21 and PASSED the requirements for a valid MOT with 0 comments.

Recorded mileage: 25,003

Recorded mileage: 25,003


MOT TEST: 27 July 2005 15:39:52 PASSED
MOT TEST: 27 July 2005 15:39:52 PASSED

This test (730708605264) was completed on the 27 July 2005 15:39:52 and PASSED the requirements for a valid MOT with 0 comments.

This test (730708605264) was completed on the 27 July 2005 15:39:52 and PASSED the requirements for a valid MOT with 0 comments.

Recorded mileage: 24,692

Recorded mileage: 24,692