JDE 563E


JDE563E is registered to a Grey 1967, Morris Minor 1000 with a Petrol engine. It Failed its most recent MOT Test on the 16 May 2017

13 unique faults (17 Total) reported in its MOT History (16 Tests).

3 common/recurring faults, the most frequent (3 times) is: Parking brake: efficiency below requirements (3.7.B.7).

62% (10) MOT Pass Rate and a 38% (6) MOT Failure Rate.

94,421 recorded miles.

JDE 563E


JDE563E is registered to a Grey 1967, Morris Minor 1000 with a Petrol engine. It Failed its most recent MOT Test on the 16 May 2017

13 unique faults (17 Total) reported in its MOT History (16 Tests).

3 common/recurring faults, the most frequent (3 times) is: Parking brake: efficiency below requirements (3.7.B.7).

62% (10) MOT Pass Rate and a 38% (6) MOT Failure Rate.

94,421 recorded miles.

MOT PASS/Failure rate for JDE 563E

all MOT test results for JDE 563E represented as a percentage
MOT PASS/Failure rate for JDE 563E
all MOT test results for JDE 563E represented as a percentage

PERCENTAGE OF VEHICLE FAULTS WITH JDE 563E

ALL REPORTED FAULTS, DISPLAYED BY PERCENTAGE OF OCCURRENCE DURING ALL MOT TESTS
PERCENTAGE OF VEHICLE FAULTS WITH JDE 563E
ALL REPORTED FAULTS, DISPLAYED BY PERCENTAGE OF OCCURRENCE DURING ALL MOT TESTS
ADVISORY

FAIL

JDE 563E annual Faults by type

ALL REPORTED FAULTS, DISPLAYED over time and categorised by type
JDE 563E annual Faults by type
ALL REPORTED FAULTS, DISPLAYED over time and categorised by type

RECURRING FAULTS WITH JDE 563E

FAULTS THAT HAVE OCCURED MORE THAN ONCE DURING JDE 563E's MOT HISTORY
RECURRING FAULTS WITH JDE 563E
FAULTS THAT HAVE OCCURED MORE THAN ONCE DURING JDE 563E's MOT HISTORY
Fault Fault Test Date Test Date/Time Reference MOT Test Reference
3 Parking brake: efficiency below requirements (3.7.b.7) Parking brake: efficiency below requirements (3.7.b.7) 21 May 2014 [09:27] 21/05/2014 23 May 2008 [14:54] 23/05/2008 18 May 2007 [16:24] 18/05/2007 166361144130 166361144130 911364348124 911364348124 603138037144 603138037144
2 Front brake application uneven (3.7.b.2) Front brake application uneven (3.7.b.2) 15 May 2015 [09:40] 15/05/2015 12 August 2011 [09:56] 12/08/2011 346905435122 346905435122 886784321234 886784321234
2 Service brake: efficiency below requirements (3.7.b.7) Service brake: efficiency below requirements (3.7.b.7) 21 May 2014 [09:27] 21/05/2014 18 May 2007 [16:24] 18/05/2007 166361144130 166361144130 603138037144 603138037144

ALL JDE 563E ADVISORIES [2]

ALL ADVISORIES, ORDERED by OCCURRENCE DURING JDE 563E's MOT HISTORY
ALL JDE 563E ADVISORIES [2]
ALL ADVISORIES, ORDERED by OCCURRENCE DURING JDE 563E's MOT HISTORY
Advisory Faults | source www.vehiclestats.co.uk
Fault Fault Test Date Test Date/Time Reference MOT Test Reference
1 Nearside steering rack gaiter deteriorated (2.2.d.2d) Nearside steering rack gaiter deteriorated (2.2.d.2d) 23 April 2013 [14:56] 23/04/2013 315393313120 315393313120
1 Nearside front track rod end ball joint has slight play (2.2.b.1f) Nearside front track rod end ball joint has slight play (2.2.b.1f) 04 June 2009 [09:52] 04/06/2009 533915359142 533915359142

ALL JDE 563E Failure Faults [15]

ALL Failure faults, ORDERED by OCCURRENCE DURING JDE 563E's MOT HISTORY
ALL JDE 563E Failure Faults [15]
ALL Failure faults, ORDERED by OCCURRENCE DURING JDE 563E's MOT HISTORY
Fail Faults | source www.vehiclestats.co.uk
Fault Fault Test Date Test Date/Time Reference MOT Test Reference
3 Parking brake: efficiency below requirements (3.7.b.7) Parking brake: efficiency below requirements (3.7.b.7) 21 May 2014 [09:27] 21/05/2014 23 May 2008 [14:54] 23/05/2008 18 May 2007 [16:24] 18/05/2007 166361144130 166361144130 911364348124 911364348124 603138037144 603138037144
2 Front brake application uneven (3.7.b.2) Front brake application uneven (3.7.b.2) 15 May 2015 [09:40] 15/05/2015 12 August 2011 [09:56] 12/08/2011 346905435122 346905435122 886784321234 886784321234
2 Service brake: efficiency below requirements (3.7.b.7) Service brake: efficiency below requirements (3.7.b.7) 21 May 2014 [09:27] 21/05/2014 18 May 2007 [16:24] 18/05/2007 166361144130 166361144130 603138037144 603138037144
1 Offside steering rack gaiter split (2.2.d.2d) Offside steering rack gaiter split (2.2.d.2d) 21 May 2014 [09:27] 21/05/2014 166361144130 166361144130
1 Nearside steering rack gaiter insecure (2.2.d.2d) Nearside steering rack gaiter insecure (2.2.d.2d) 21 May 2014 [09:27] 21/05/2014 166361144130 166361144130
1 Rear brake hose leaking (3.6.a.1) Rear brake hose leaking (3.6.a.1) 02 July 2010 [12:00] 02/07/2010 510023680155 510023680155
1 Offside rear brake binding (3.7.b.1) Offside rear brake binding (3.7.b.1) 02 July 2010 [12:00] 02/07/2010 510023680155 510023680155
1 Offside rear rear brake recording little or no effort (3.7.b.5a) Offside rear rear brake recording little or no effort (3.7.b.5a) 23 May 2008 [14:54] 23/05/2008 911364348124 911364348124
1 Registration plate lamp not working (1.1.5c) Registration plate lamp not working (1.1.5c) 18 May 2007 [16:24] 18/05/2007 603138037144 603138037144
1 Nearside steering rack gaiter split (2.2.d.2d) Nearside steering rack gaiter split (2.2.d.2d) 18 May 2007 [16:24] 18/05/2007 603138037144 603138037144
1 Offside rear brake recording little or no effort (3.7.b.5a) Offside rear brake recording little or no effort (3.7.b.5a) 18 May 2007 [16:24] 18/05/2007 603138037144 603138037144

MOT TEST: 16 May 2017 10:40:47 PASSED
MOT TEST: 16 May 2017 10:40:47 PASSED

This test (945885334197) was completed on the 16 May 2017 10:40:47 and PASSED the requirements for a valid MOT with 0 comments.

This test (945885334197) was completed on the 16 May 2017 10:40:47 and PASSED the requirements for a valid MOT with 0 comments.

Recorded mileage: 16,772

Recorded mileage: 16,772


MOT TEST: 19 May 2016 11:56:57 PASSED
MOT TEST: 19 May 2016 11:56:57 PASSED

This test (875492083178) was completed on the 19 May 2016 11:56:57 and PASSED the requirements for a valid MOT with 0 comments.

This test (875492083178) was completed on the 19 May 2016 11:56:57 and PASSED the requirements for a valid MOT with 0 comments.

Recorded mileage: 16,030

Recorded mileage: 16,030


MOT TEST: 18 May 2015 14:07:42 PASSED
MOT TEST: 18 May 2015 14:07:42 PASSED

This test (196248135128) was completed on the 18 May 2015 14:07:42 and PASSED the requirements for a valid MOT with 0 comments.

This test (196248135128) was completed on the 18 May 2015 14:07:42 and PASSED the requirements for a valid MOT with 0 comments.

Recorded mileage: 15,190

Recorded mileage: 15,190


MOT TEST: 15 May 2015 09:40:21 FAILED
MOT TEST: 15 May 2015 09:40:21 FAILED

This test (346905435122) was completed on the 15 May 2015 09:40:21 and FAILED the requirements for a valid MOT with 1 comments.

This test (346905435122) was completed on the 15 May 2015 09:40:21 and FAILED the requirements for a valid MOT with 1 comments.

Recorded mileage: 15,027

Recorded mileage: 15,027


FAIL


MOT TEST: 22 May 2014 11:28:36 PASSED
MOT TEST: 22 May 2014 11:28:36 PASSED

This test (987322844131) was completed on the 22 May 2014 11:28:36 and PASSED the requirements for a valid MOT with 0 comments.

This test (987322844131) was completed on the 22 May 2014 11:28:36 and PASSED the requirements for a valid MOT with 0 comments.

Recorded mileage: 14,157

Recorded mileage: 14,157


MOT TEST: 21 May 2014 09:27:42 FAILED
MOT TEST: 21 May 2014 09:27:42 FAILED

This test (166361144130) was completed on the 21 May 2014 09:27:42 and FAILED the requirements for a valid MOT with 4 comments.

This test (166361144130) was completed on the 21 May 2014 09:27:42 and FAILED the requirements for a valid MOT with 4 comments.

Recorded mileage: 14,156

Recorded mileage: 14,156


FAIL


MOT TEST: 23 April 2013 14:56:16 PASSED
MOT TEST: 23 April 2013 14:56:16 PASSED

This test (315393313120) was completed on the 23 April 2013 14:56:16 and PASSED the requirements for a valid MOT with 1 comments.

This test (315393313120) was completed on the 23 April 2013 14:56:16 and PASSED the requirements for a valid MOT with 1 comments.

Recorded mileage: 12,963

Recorded mileage: 12,963


ADVISORY


MOT TEST: 12 August 2011 14:53:45 PASSED
MOT TEST: 12 August 2011 14:53:45 PASSED

This test (455674221239) was completed on the 12 August 2011 14:53:45 and PASSED the requirements for a valid MOT with 0 comments.

This test (455674221239) was completed on the 12 August 2011 14:53:45 and PASSED the requirements for a valid MOT with 0 comments.

Recorded mileage: 11,404

Recorded mileage: 11,404


MOT TEST: 12 August 2011 09:56:54 FAILED
MOT TEST: 12 August 2011 09:56:54 FAILED

This test (886784321234) was completed on the 12 August 2011 09:56:54 and FAILED the requirements for a valid MOT with 1 comments.

This test (886784321234) was completed on the 12 August 2011 09:56:54 and FAILED the requirements for a valid MOT with 1 comments.

Recorded mileage: 11,339

Recorded mileage: 11,339


FAIL


MOT TEST: 08 July 2010 11:32:36 PASSED
MOT TEST: 08 July 2010 11:32:36 PASSED

This test (770309580148) was completed on the 08 July 2010 11:32:36 and PASSED the requirements for a valid MOT with 0 comments.

This test (770309580148) was completed on the 08 July 2010 11:32:36 and PASSED the requirements for a valid MOT with 0 comments.

Recorded mileage: 10,726

Recorded mileage: 10,726


MOT TEST: 02 July 2010 12:00:46 FAILED
MOT TEST: 02 July 2010 12:00:46 FAILED

This test (510023680155) was completed on the 02 July 2010 12:00:46 and FAILED the requirements for a valid MOT with 2 comments.

This test (510023680155) was completed on the 02 July 2010 12:00:46 and FAILED the requirements for a valid MOT with 2 comments.

Recorded mileage: 10,720

Recorded mileage: 10,720


FAIL


MOT TEST: 04 June 2009 09:52:00 PASSED
MOT TEST: 04 June 2009 09:52:00 PASSED

This test (533915359142) was completed on the 04 June 2009 09:52:00 and PASSED the requirements for a valid MOT with 1 comments.

This test (533915359142) was completed on the 04 June 2009 09:52:00 and PASSED the requirements for a valid MOT with 1 comments.

Recorded mileage: 10,141

Recorded mileage: 10,141


ADVISORY


MOT TEST: 23 May 2008 16:28:52 PASSED
MOT TEST: 23 May 2008 16:28:52 PASSED

This test (903774648167) was completed on the 23 May 2008 16:28:52 and PASSED the requirements for a valid MOT with 0 comments.

This test (903774648167) was completed on the 23 May 2008 16:28:52 and PASSED the requirements for a valid MOT with 0 comments.

Recorded mileage: 9,971

Recorded mileage: 9,971


MOT TEST: 23 May 2008 14:54:58 FAILED
MOT TEST: 23 May 2008 14:54:58 FAILED

This test (911364348124) was completed on the 23 May 2008 14:54:58 and FAILED the requirements for a valid MOT with 2 comments.

This test (911364348124) was completed on the 23 May 2008 14:54:58 and FAILED the requirements for a valid MOT with 2 comments.

Recorded mileage: 9,969

Recorded mileage: 9,969


FAIL


MOT TEST: 24 May 2007 16:54:47 PASSED
MOT TEST: 24 May 2007 16:54:47 PASSED

This test (630564447173) was completed on the 24 May 2007 16:54:47 and PASSED the requirements for a valid MOT with 0 comments.

This test (630564447173) was completed on the 24 May 2007 16:54:47 and PASSED the requirements for a valid MOT with 0 comments.

Recorded mileage: 94,421

Recorded mileage: 94,421


MOT TEST: 18 May 2007 16:24:08 FAILED
MOT TEST: 18 May 2007 16:24:08 FAILED

This test (603138037144) was completed on the 18 May 2007 16:24:08 and FAILED the requirements for a valid MOT with 5 comments.

This test (603138037144) was completed on the 18 May 2007 16:24:08 and FAILED the requirements for a valid MOT with 5 comments.

Recorded mileage: 9,439

Recorded mileage: 9,439


FAIL