JDL 731F


JDL731F is registered to a Red 1967, Morris Mini with a Petrol engine. It Failed its most recent MOT Test on the 28 April 2017

42 unique faults (48 Total) reported in its MOT History (9 Tests).

5 common/recurring faults, the most frequent (3 times) is: Exhaust has a minor leak of exhaust gases (7.1.2).

67% (6) MOT Pass Rate and a 33% (3) MOT Failure Rate.

49,999 recorded miles.

JDL 731F


JDL731F is registered to a Red 1967, Morris Mini with a Petrol engine. It Failed its most recent MOT Test on the 28 April 2017

42 unique faults (48 Total) reported in its MOT History (9 Tests).

5 common/recurring faults, the most frequent (3 times) is: Exhaust has a minor leak of exhaust gases (7.1.2).

67% (6) MOT Pass Rate and a 33% (3) MOT Failure Rate.

49,999 recorded miles.

MOT PASS/Failure rate for JDL 731F

all MOT test results for JDL 731F represented as a percentage
MOT PASS/Failure rate for JDL 731F
all MOT test results for JDL 731F represented as a percentage

PERCENTAGE OF VEHICLE FAULTS WITH JDL 731F

ALL REPORTED FAULTS, DISPLAYED BY PERCENTAGE OF OCCURRENCE DURING ALL MOT TESTS
PERCENTAGE OF VEHICLE FAULTS WITH JDL 731F
ALL REPORTED FAULTS, DISPLAYED BY PERCENTAGE OF OCCURRENCE DURING ALL MOT TESTS
ADVISORY

FAIL

USER ENTERED

JDL 731F annual Faults by type

ALL REPORTED FAULTS, DISPLAYED over time and categorised by type
JDL 731F annual Faults by type
ALL REPORTED FAULTS, DISPLAYED over time and categorised by type

RECURRING FAULTS WITH JDL 731F

FAULTS THAT HAVE OCCURED MORE THAN ONCE DURING JDL 731F's MOT HISTORY
RECURRING FAULTS WITH JDL 731F
FAULTS THAT HAVE OCCURED MORE THAN ONCE DURING JDL 731F's MOT HISTORY
Fault Fault Test Date Test Date/Time Reference MOT Test Reference
3 Exhaust has a minor leak of exhaust gases (7.1.2) Exhaust has a minor leak of exhaust gases (7.1.2) 18 April 2016 [16:18] 18/04/2016 04 April 2016 [16:30] 04/04/2016 09 March 2015 [12:00] 09/03/2015 633292279254 633292279254 166680308123 166680308123 658748265001 658748265001
2 Both tie bar bolts u.s.d Both tie bar bolts u.s.d 18 April 2016 [16:18] 18/04/2016 04 April 2016 [16:30] 04/04/2016 633292279254 633292279254 166680308123 166680308123
2 Offside front suspension has slight play in a lower suspension ball joint (2.5.b.1a) Offside front suspension has slight play in a lower suspension ball joint (2.5.b.1a) 18 April 2016 [16:18] 18/04/2016 04 April 2016 [16:30] 04/04/2016 633292279254 633292279254 166680308123 166680308123
2 Advise slight play nearside end steering rack Advise slight play nearside end steering rack 16 December 2011 [10:52] 16/12/2011 15 December 2011 [15:37] 15/12/2011 809850651389 809850651389 696419441310 696419441310
2 Advise exhaust slightly noisey Advise exhaust slightly noisey 16 December 2011 [10:52] 16/12/2011 15 December 2011 [15:37] 15/12/2011 809850651389 809850651389 696419441310 696419441310

ALL JDL 731F ADVISORIES [10]

ALL ADVISORIES, ORDERED by OCCURRENCE DURING JDL 731F's MOT HISTORY
ALL JDL 731F ADVISORIES [10]
ALL ADVISORIES, ORDERED by OCCURRENCE DURING JDL 731F's MOT HISTORY
Advisory Faults | source www.vehiclestats.co.uk
Fault Fault Test Date Test Date/Time Reference MOT Test Reference
3 Exhaust has a minor leak of exhaust gases (7.1.2) Exhaust has a minor leak of exhaust gases (7.1.2) 18 April 2016 [16:18] 18/04/2016 04 April 2016 [16:30] 04/04/2016 09 March 2015 [12:00] 09/03/2015 633292279254 633292279254 166680308123 166680308123 658748265001 658748265001
2 Both tie bar bolts u.s.d Both tie bar bolts u.s.d 18 April 2016 [16:18] 18/04/2016 04 April 2016 [16:30] 04/04/2016 633292279254 633292279254 166680308123 166680308123
2 Offside front suspension has slight play in a lower suspension ball joint (2.5.b.1a) Offside front suspension has slight play in a lower suspension ball joint (2.5.b.1a) 18 April 2016 [16:18] 18/04/2016 04 April 2016 [16:30] 04/04/2016 633292279254 633292279254 166680308123 166680308123
1 Offside front lower suspension arm has slight play in a ball joint (2.4.g.2) Offside front lower suspension arm has slight play in a ball joint (2.4.g.2) 09 March 2015 [12:00] 09/03/2015 658748265001 658748265001
1 Offside rear rear wheel bearing has slight play (2.6.2) Offside rear rear wheel bearing has slight play (2.6.2) 11 February 2014 [17:06] 11/02/2014 567192644046 567192644046
1 Service brake: service brake efficiency only just met. It would appear that the braking system requires adjustment or repair. (3.7.b.7) Service brake: service brake efficiency only just met. It would appear that the braking system requires adjustment or repair. (3.7.b.7) 15 December 2011 [15:37] 15/12/2011 696419441310 696419441310

ALL JDL 731F Failure Faults [30]

ALL Failure faults, ORDERED by OCCURRENCE DURING JDL 731F's MOT HISTORY
ALL JDL 731F Failure Faults [30]
ALL Failure faults, ORDERED by OCCURRENCE DURING JDL 731F's MOT HISTORY
Fail Faults | source www.vehiclestats.co.uk
Fault Fault Test Date Test Date/Time Reference MOT Test Reference
1 Parking brake: efficiency below requirements (3.7.b.7) Parking brake: efficiency below requirements (3.7.b.7) 04 April 2016 [16:30] 04/04/2016 166680308123 166680308123
1 Rear brakes imbalanced across an axle axle 2 (3.7.b.5b) Rear brakes imbalanced across an axle axle 2 (3.7.b.5b) 04 April 2016 [16:30] 04/04/2016 166680308123 166680308123
1 Nearside front front parking (secondary) brake grabbing severely (3.7.b.6b) Nearside front front parking (secondary) brake grabbing severely (3.7.b.6b) 04 April 2016 [16:30] 04/04/2016 166680308123 166680308123
1 Windscreen wiper blade missing both (8.2.2) Windscreen wiper blade missing both (8.2.2) 04 April 2016 [16:30] 04/04/2016 166680308123 166680308123
1 Indicator tell tale inoperative (1.4.a.2a) Indicator tell tale inoperative (1.4.a.2a) 04 April 2016 [16:30] 04/04/2016 166680308123 166680308123
1 Windscreen washer provides insufficient washer liquid (8.2.3) Windscreen washer provides insufficient washer liquid (8.2.3) 04 April 2016 [16:30] 04/04/2016 166680308123 166680308123
1 Headlamp aim too high both (1.8) Headlamp aim too high both (1.8) 04 April 2016 [16:30] 04/04/2016 166680308123 166680308123
1 Front exhaust system not adequately supported missing (7.1.1) Front exhaust system not adequately supported missing (7.1.1) 04 April 2016 [16:30] 04/04/2016 166680308123 166680308123
1 Offside brake cable has a seized clevis joint pivot (3.5.1c) Offside brake cable has a seized clevis joint pivot (3.5.1c) 04 April 2016 [16:30] 04/04/2016 166680308123 166680308123
1 Nearside front suspension has a suspension lower ball joint securing nut not locked (2.5.b.1a) Nearside front suspension has a suspension lower ball joint securing nut not locked (2.5.b.1a) 04 April 2016 [16:30] 04/04/2016 166680308123 166680308123
1 Horn not working (1.6.2a) Horn not working (1.6.2a) 11 February 2014 [17:06] 11/02/2014 567192644046 567192644046
1 Nearside headlamp not working on main beam (1.7.5a) Nearside headlamp not working on main beam (1.7.5a) 11 February 2014 [17:06] 11/02/2014 567192644046 567192644046
1 Offside headlamp not working on main beam (1.7.5a) Offside headlamp not working on main beam (1.7.5a) 11 February 2014 [17:06] 11/02/2014 567192644046 567192644046
1 Offside headlamp aim too high (1.8) Offside headlamp aim too high (1.8) 11 February 2014 [17:06] 11/02/2014 567192644046 567192644046
1 Nearside front position lamp(s) incorrect colour (1.1.a.3e) Nearside front position lamp(s) incorrect colour (1.1.a.3e) 11 February 2014 [17:06] 11/02/2014 567192644046 567192644046
1 Offside front position lamp(s) incorrect colour (1.1.a.3e) Offside front position lamp(s) incorrect colour (1.1.a.3e) 11 February 2014 [17:06] 11/02/2014 567192644046 567192644046
1 Nearside registration plate lamp shows direct white light to the rear (1.1.c.1f) Nearside registration plate lamp shows direct white light to the rear (1.1.c.1f) 11 February 2014 [17:06] 11/02/2014 567192644046 567192644046
1 Offside registration plate lamp shows direct white light to the rear (1.1.c.1f) Offside registration plate lamp shows direct white light to the rear (1.1.c.1f) 11 February 2014 [17:06] 11/02/2014 567192644046 567192644046
1 Steering column top bearing excessively worn (2.1.2c) Steering column top bearing excessively worn (2.1.2c) 11 February 2014 [17:06] 11/02/2014 567192644046 567192644046
1 Offside outer front constant velocity joint gaiter damaged to the extent that it no longer prevents the ingress of dirt etc (2.5.c.1a) Offside outer front constant velocity joint gaiter damaged to the extent that it no longer prevents the ingress of dirt etc (2.5.c.1a) 11 February 2014 [17:06] 11/02/2014 567192644046 567192644046
1 Offside front front wheel bearing has excessive play (2.5.a.3c) Offside front front wheel bearing has excessive play (2.5.a.3c) 11 February 2014 [17:06] 11/02/2014 567192644046 567192644046
1 Nearside rear rear wheel bearing has excessive play (2.6.2) Nearside rear rear wheel bearing has excessive play (2.6.2) 11 February 2014 [17:06] 11/02/2014 567192644046 567192644046
1 Nearside front constant velocity joint gaiter insecurely mounted to its housing (2.5.c.1a) Nearside front constant velocity joint gaiter insecurely mounted to its housing (2.5.c.1a) 15 December 2011 [15:37] 15/12/2011 696419441310 696419441310
1 Offside direction indicators flashing less than 60 times a minute (1.4.a.2g) Offside direction indicators flashing less than 60 times a minute (1.4.a.2g) 15 December 2011 [15:37] 15/12/2011 696419441310 696419441310
1 Nearside front suspension arm has excessive play in a pin/bush (2.4.g.2) Nearside front suspension arm has excessive play in a pin/bush (2.4.g.2) 15 December 2011 [15:37] 15/12/2011 696419441310 696419441310
1 Offside front suspension arm has excessive play in a pin/bush (2.4.g.2) Offside front suspension arm has excessive play in a pin/bush (2.4.g.2) 15 December 2011 [15:37] 15/12/2011 696419441310 696419441310
1 Front brake application uneven (3.7.b.2) Front brake application uneven (3.7.b.2) 15 December 2011 [15:37] 15/12/2011 696419441310 696419441310
1 Front brakes release unevenly (3.7.b.4) Front brakes release unevenly (3.7.b.4) 15 December 2011 [15:37] 15/12/2011 696419441310 696419441310
1 Offside front brake binding (3.7.b.1) Offside front brake binding (3.7.b.1) 15 December 2011 [15:37] 15/12/2011 696419441310 696419441310
1 Brakes imbalanced across an axle (3.7.b.5b) Brakes imbalanced across an axle (3.7.b.5b) 15 December 2011 [15:37] 15/12/2011 696419441310 696419441310

ALL JDL 731F User Entered Faults [8]

ALL User Entered faults, ORDERED by OCCURRENCE DURING JDL 731F's MOT HISTORY
ALL JDL 731F User Entered Faults [8]
ALL User Entered faults, ORDERED by OCCURRENCE DURING JDL 731F's MOT HISTORY
User Entered Faults | source www.vehiclestats.co.uk
Fault Fault Test Date Test Date/Time Reference MOT Test Reference
2 Advise slight play nearside end steering rack Advise slight play nearside end steering rack 16 December 2011 [10:52] 16/12/2011 15 December 2011 [15:37] 15/12/2011 809850651389 809850651389 696419441310 696419441310
2 Advise exhaust slightly noisey Advise exhaust slightly noisey 16 December 2011 [10:52] 16/12/2011 15 December 2011 [15:37] 15/12/2011 809850651389 809850651389 696419441310 696419441310
1 Nail in nearside rear tyre Nail in nearside rear tyre 09 March 2015 [12:00] 09/03/2015 658748265001 658748265001
1 Small corrosion on drivers floor pan Small corrosion on drivers floor pan 09 March 2015 [12:00] 09/03/2015 658748265001 658748265001
1 Oil leak Oil leak 11 February 2014 [17:06] 11/02/2014 567192644046 567192644046
1 Play in steering rack inner joint(s) Play in steering rack inner joint(s) 30 January 2013 [15:38] 30/01/2013 365760333020 365760333020

MOT TEST: 28 April 2017 13:57:07 PASSED
MOT TEST: 28 April 2017 13:57:07 PASSED

This test (184463727356) was completed on the 28 April 2017 13:57:07 and PASSED the requirements for a valid MOT with 0 comments.

This test (184463727356) was completed on the 28 April 2017 13:57:07 and PASSED the requirements for a valid MOT with 0 comments.

Recorded mileage: 49,999

Recorded mileage: 49,999


MOT TEST: 18 April 2016 16:18:59 PASSED
MOT TEST: 18 April 2016 16:18:59 PASSED

This test (633292279254) was completed on the 18 April 2016 16:18:59 and PASSED the requirements for a valid MOT with 3 comments.

This test (633292279254) was completed on the 18 April 2016 16:18:59 and PASSED the requirements for a valid MOT with 3 comments.

Recorded mileage: 49,999

Recorded mileage: 49,999


ADVISORY


MOT TEST: 04 April 2016 16:30:03 FAILED
MOT TEST: 04 April 2016 16:30:03 FAILED

This test (166680308123) was completed on the 04 April 2016 16:30:03 and FAILED the requirements for a valid MOT with 13 comments.

This test (166680308123) was completed on the 04 April 2016 16:30:03 and FAILED the requirements for a valid MOT with 13 comments.

Recorded mileage: 49,999

Recorded mileage: 49,999


ADVISORY

FAIL


MOT TEST: 09 March 2015 12:00:26 PASSED
MOT TEST: 09 March 2015 12:00:26 PASSED

This test (658748265001) was completed on the 09 March 2015 12:00:26 and PASSED the requirements for a valid MOT with 4 comments.

This test (658748265001) was completed on the 09 March 2015 12:00:26 and PASSED the requirements for a valid MOT with 4 comments.

Recorded mileage: 49,999

Recorded mileage: 49,999


ADVISORY

USER ENTERED


MOT TEST: 11 February 2014 17:06:32 FAILED
MOT TEST: 11 February 2014 17:06:32 FAILED

This test (567192644046) was completed on the 11 February 2014 17:06:32 and FAILED the requirements for a valid MOT with 14 comments.

This test (567192644046) was completed on the 11 February 2014 17:06:32 and FAILED the requirements for a valid MOT with 14 comments.

Recorded mileage: 49,681

Recorded mileage: 49,681


ADVISORY

FAIL

USER ENTERED


MOT TEST: 01 February 2014 07:35:14 PASSED
MOT TEST: 01 February 2014 07:35:14 PASSED

This test (436972434068) was completed on the 01 February 2014 07:35:14 and PASSED the requirements for a valid MOT with 0 comments.

This test (436972434068) was completed on the 01 February 2014 07:35:14 and PASSED the requirements for a valid MOT with 0 comments.

Recorded mileage: 49,534

Recorded mileage: 49,534


MOT TEST: 30 January 2013 15:38:52 PASSED
MOT TEST: 30 January 2013 15:38:52 PASSED

This test (365760333020) was completed on the 30 January 2013 15:38:52 and PASSED the requirements for a valid MOT with 1 comments.

This test (365760333020) was completed on the 30 January 2013 15:38:52 and PASSED the requirements for a valid MOT with 1 comments.

Recorded mileage: 49,237

Recorded mileage: 49,237


USER ENTERED


MOT TEST: 16 December 2011 10:52:21 PASSED
MOT TEST: 16 December 2011 10:52:21 PASSED

This test (809850651389) was completed on the 16 December 2011 10:52:21 and PASSED the requirements for a valid MOT with 2 comments.

This test (809850651389) was completed on the 16 December 2011 10:52:21 and PASSED the requirements for a valid MOT with 2 comments.

Recorded mileage: 41,725

Recorded mileage: 41,725


USER ENTERED


MOT TEST: 15 December 2011 15:37:57 FAILED
MOT TEST: 15 December 2011 15:37:57 FAILED

This test (696419441310) was completed on the 15 December 2011 15:37:57 and FAILED the requirements for a valid MOT with 11 comments.

This test (696419441310) was completed on the 15 December 2011 15:37:57 and FAILED the requirements for a valid MOT with 11 comments.

Recorded mileage: 41,722

Recorded mileage: 41,722


ADVISORY

FAIL

USER ENTERED