JDM 565D


JDM565D is registered to a White 1966, Morris Minor 1000 with a Petrol engine. It Passed its most recent MOT Test on the 27 June 2018

24 unique faults (27 Total) reported in its MOT History (15 Tests).

3 common/recurring faults, the most frequent (2 times) is: Spare tyre defective cross ply tyre dangerous if fitted on vehicle ().

60% (9) MOT Pass Rate and a 40% (6) MOT Failure Rate.

77,428 recorded miles.

JDM 565D


JDM565D is registered to a White 1966, Morris Minor 1000 with a Petrol engine. It Passed its most recent MOT Test on the 27 June 2018

24 unique faults (27 Total) reported in its MOT History (15 Tests).

3 common/recurring faults, the most frequent (2 times) is: Spare tyre defective cross ply tyre dangerous if fitted on vehicle ().

60% (9) MOT Pass Rate and a 40% (6) MOT Failure Rate.

77,428 recorded miles.

MOT PASS/Failure rate for JDM 565D

all MOT test results for JDM 565D represented as a percentage
MOT PASS/Failure rate for JDM 565D
all MOT test results for JDM 565D represented as a percentage

PERCENTAGE OF VEHICLE FAULTS WITH JDM 565D

ALL REPORTED FAULTS, DISPLAYED BY PERCENTAGE OF OCCURRENCE DURING ALL MOT TESTS
PERCENTAGE OF VEHICLE FAULTS WITH JDM 565D
ALL REPORTED FAULTS, DISPLAYED BY PERCENTAGE OF OCCURRENCE DURING ALL MOT TESTS
ADVISORY

FAIL

PASS WITH RECTIFICATION

JDM 565D annual Faults by type

ALL REPORTED FAULTS, DISPLAYED over time and categorised by type
JDM 565D annual Faults by type
ALL REPORTED FAULTS, DISPLAYED over time and categorised by type

RECURRING FAULTS WITH JDM 565D

FAULTS THAT HAVE OCCURED MORE THAN ONCE DURING JDM 565D's MOT HISTORY
RECURRING FAULTS WITH JDM 565D
FAULTS THAT HAVE OCCURED MORE THAN ONCE DURING JDM 565D's MOT HISTORY
Fault Fault Test Date Test Date/Time Reference MOT Test Reference
2 Spare tyre defective cross ply tyre dangerous if fitted on vehicle () Spare tyre defective cross ply tyre dangerous if fitted on vehicle () 27 June 2018 [10:16] 27/06/2018 27 June 2018 [10:16] 27/06/2018 376723599218 376723599218 416534947399 416534947399
2 Nearside rear direction indicator not working (1.4.a.2c) Nearside rear direction indicator not working (1.4.a.2c) 23 May 2017 [10:45] 23/05/2017 17 May 2016 [09:08] 17/05/2016 440084994763 440084994763 902625557782 902625557782
2 Service brake: efficiency below requirements (3.7.b.7) Service brake: efficiency below requirements (3.7.b.7) 09 June 2014 [10:16] 09/06/2014 17 March 2008 [13:05] 17/03/2008 978370764131 978370764131 893037578022 893037578022

ALL JDM 565D ADVISORIES [2]

ALL ADVISORIES, ORDERED by OCCURRENCE DURING JDM 565D's MOT HISTORY
ALL JDM 565D ADVISORIES [2]
ALL ADVISORIES, ORDERED by OCCURRENCE DURING JDM 565D's MOT HISTORY
Advisory Faults | source www.vehiclestats.co.uk
Fault Fault Test Date Test Date/Time Reference MOT Test Reference
2 Spare tyre defective cross ply tyre dangerous if fitted on vehicle () Spare tyre defective cross ply tyre dangerous if fitted on vehicle () 27 June 2018 [10:16] 27/06/2018 27 June 2018 [10:16] 27/06/2018 376723599218 376723599218 416534947399 416534947399

ALL JDM 565D Failure Faults [22]

ALL Failure faults, ORDERED by OCCURRENCE DURING JDM 565D's MOT HISTORY
ALL JDM 565D Failure Faults [22]
ALL Failure faults, ORDERED by OCCURRENCE DURING JDM 565D's MOT HISTORY
Fail Faults | source www.vehiclestats.co.uk
Fault Fault Test Date Test Date/Time Reference MOT Test Reference
2 Service brake: efficiency below requirements (3.7.b.7) Service brake: efficiency below requirements (3.7.b.7) 09 June 2014 [10:16] 09/06/2014 17 March 2008 [13:05] 17/03/2008 978370764131 978370764131 893037578022 893037578022
1 Nearside rear brake binding (3.7.b.1) Nearside rear brake binding (3.7.b.1) 23 May 2017 [10:45] 23/05/2017 440084994763 440084994763
1 Offside front brake binding (3.7.b.1) Offside front brake binding (3.7.b.1) 17 May 2016 [09:08] 17/05/2016 902625557782 902625557782
1 Nearside rear brake pipe inadequately clipped (3.6.b.1) Nearside rear brake pipe inadequately clipped (3.6.b.1) 17 May 2016 [09:08] 17/05/2016 902625557782 902625557782
1 Offside rear brake pipe inadequately clipped (3.6.b.1) Offside rear brake pipe inadequately clipped (3.6.b.1) 17 May 2016 [09:08] 17/05/2016 902625557782 902625557782
1 Nearside front suspension component mounting prescribed area is excessively corroded (2.4.a.3) Nearside front suspension component mounting prescribed area is excessively corroded (2.4.a.3) 17 May 2016 [09:08] 17/05/2016 902625557782 902625557782
1 Offside rear suspension spring mounting prescribed area is excessively corroded front mount (2.4.a.3) Offside rear suspension spring mounting prescribed area is excessively corroded front mount (2.4.a.3) 17 May 2016 [09:08] 17/05/2016 902625557782 902625557782
1 Nearside rear suspension spring mounting prescribed area is excessively corroded front mount (2.4.a.3) Nearside rear suspension spring mounting prescribed area is excessively corroded front mount (2.4.a.3) 17 May 2016 [09:08] 17/05/2016 902625557782 902625557782
1 Nearside rear suspension spring mounting prescribed area is excessively corroded rear mount (2.4.a.3) Nearside rear suspension spring mounting prescribed area is excessively corroded rear mount (2.4.a.3) 17 May 2016 [09:08] 17/05/2016 902625557782 902625557782
1 Nearside rear direction indicator not working (1.4.a.2c) Nearside rear direction indicator not working (1.4.a.2c) 17 May 2016 [09:08] 17/05/2016 902625557782 902625557782
1 Nearside rear position lamp(s) excessively deteriorated so that it is not visible from a reasonable distance (1.1.a.3d) Nearside rear position lamp(s) excessively deteriorated so that it is not visible from a reasonable distance (1.1.a.3d) 17 May 2016 [09:08] 17/05/2016 902625557782 902625557782
1 Offside rear position lamp(s) excessively deteriorated so that it is not visible from a reasonable distance (1.1.a.3d) Offside rear position lamp(s) excessively deteriorated so that it is not visible from a reasonable distance (1.1.a.3d) 17 May 2016 [09:08] 17/05/2016 902625557782 902625557782
1 Front brake application uneven (3.7.b.2) Front brake application uneven (3.7.b.2) 09 June 2014 [10:16] 09/06/2014 978370764131 978370764131
1 Rear brake application uneven (3.7.b.2) Rear brake application uneven (3.7.b.2) 09 June 2014 [10:16] 09/06/2014 978370764131 978370764131
1 Brake pedal anti-slip provision missing (3.3.a.1b) Brake pedal anti-slip provision missing (3.3.a.1b) 09 June 2014 [10:16] 09/06/2014 978370764131 978370764131
1 Offside windscreen wiper does not clear the windscreen effectively (8.2.2) Offside windscreen wiper does not clear the windscreen effectively (8.2.2) 09 June 2014 [10:16] 09/06/2014 978370764131 978370764131
1 Rear brake pipe inadequately supported (3.6.b.1) Rear brake pipe inadequately supported (3.6.b.1) 09 June 2014 [10:16] 09/06/2014 978370764131 978370764131
1 Nearside steering rack gaiter split (2.2.d.2d) Nearside steering rack gaiter split (2.2.d.2d) 09 June 2014 [10:16] 09/06/2014 978370764131 978370764131
1 Brakes imbalanced across an axle (3.7.b.5b) Brakes imbalanced across an axle (3.7.b.5b) 09 June 2014 [10:16] 09/06/2014 978370764131 978370764131
1 Direction indicators not in good working order (function impaired) (1.5.a1b) Direction indicators not in good working order (function impaired) (1.5.a1b) 17 March 2008 [13:05] 17/03/2008 893037578022 893037578022
1 Offside rear brake binding (3.7.b.1) Offside rear brake binding (3.7.b.1) 17 March 2008 [13:05] 17/03/2008 893037578022 893037578022

ALL JDM 565D Pass With Rectification Faults [3]

ALL Pass With Rectification faults, ORDERED by OCCURRENCE DURING JDM 565D's MOT HISTORY
ALL JDM 565D Pass With Rectification Faults [3]
ALL Pass With Rectification faults, ORDERED by OCCURRENCE DURING JDM 565D's MOT HISTORY
Advisory Faults | source www.vehiclestats.co.uk
Fault Fault Test Date Test Date/Time Reference MOT Test Reference
1 Nearside rear direction indicator not working (4.4.1 (a) (ii)) Nearside rear direction indicator not working (4.4.1 (a) (ii)) 27 June 2018 [10:16] 27/06/2018 416534947399 416534947399
1 Nearside rear direction indicator not working (1.4.a.2c) Nearside rear direction indicator not working (1.4.a.2c) 23 May 2017 [10:45] 23/05/2017 440084994763 440084994763
1 Windscreen washer provides insufficient washer liquid (8.2.3) Windscreen washer provides insufficient washer liquid (8.2.3) 28 June 2012 [09:29] 28/06/2012 118320582161 118320582161

MOT TEST: 27 June 2018 10:16:59 PASSED
MOT TEST: 27 June 2018 10:16:59 PASSED

This test (376723599218) was completed on the 27 June 2018 10:16:59 and PASSED the requirements for a valid MOT with 1 comments.

This test (376723599218) was completed on the 27 June 2018 10:16:59 and PASSED the requirements for a valid MOT with 1 comments.

Recorded mileage: 77,428

Recorded mileage: 77,428


ADVISORY


MOT TEST: 27 June 2018 10:16:58 FAILED
MOT TEST: 27 June 2018 10:16:58 FAILED

This test (416534947399) was completed on the 27 June 2018 10:16:58 and FAILED the requirements for a valid MOT with 2 comments.

This test (416534947399) was completed on the 27 June 2018 10:16:58 and FAILED the requirements for a valid MOT with 2 comments.

Recorded mileage: 77,428

Recorded mileage: 77,428


ADVISORY

PASS WITH RECTIFICATION


MOT TEST: 25 May 2017 09:48:05 PASSED
MOT TEST: 25 May 2017 09:48:05 PASSED

This test (882560636378) was completed on the 25 May 2017 09:48:05 and PASSED the requirements for a valid MOT with 0 comments.

This test (882560636378) was completed on the 25 May 2017 09:48:05 and PASSED the requirements for a valid MOT with 0 comments.

Recorded mileage: 77,087

Recorded mileage: 77,087


MOT TEST: 23 May 2017 10:45:36 FAILED
MOT TEST: 23 May 2017 10:45:36 FAILED

This test (440084994763) was completed on the 23 May 2017 10:45:36 and FAILED the requirements for a valid MOT with 2 comments.

This test (440084994763) was completed on the 23 May 2017 10:45:36 and FAILED the requirements for a valid MOT with 2 comments.

Recorded mileage: 77,087

Recorded mileage: 77,087


FAIL

PASS WITH RECTIFICATION


MOT TEST: 01 June 2016 10:55:41 PASSED
MOT TEST: 01 June 2016 10:55:41 PASSED

This test (846886877985) was completed on the 01 June 2016 10:55:41 and PASSED the requirements for a valid MOT with 0 comments.

This test (846886877985) was completed on the 01 June 2016 10:55:41 and PASSED the requirements for a valid MOT with 0 comments.

Recorded mileage: 76,288

Recorded mileage: 76,288


MOT TEST: 17 May 2016 09:08:09 FAILED
MOT TEST: 17 May 2016 09:08:09 FAILED

This test (902625557782) was completed on the 17 May 2016 09:08:09 and FAILED the requirements for a valid MOT with 10 comments.

This test (902625557782) was completed on the 17 May 2016 09:08:09 and FAILED the requirements for a valid MOT with 10 comments.

Recorded mileage: 76,287

Recorded mileage: 76,287


FAIL


MOT TEST: 19 June 2015 12:56:01 PASSED
MOT TEST: 19 June 2015 12:56:01 PASSED

This test (919290175193) was completed on the 19 June 2015 12:56:01 and PASSED the requirements for a valid MOT with 0 comments.

This test (919290175193) was completed on the 19 June 2015 12:56:01 and PASSED the requirements for a valid MOT with 0 comments.

Recorded mileage: 76,047

Recorded mileage: 76,047


MOT TEST: 10 June 2014 11:35:12 PASSED
MOT TEST: 10 June 2014 11:35:12 PASSED

This test (948491164118) was completed on the 10 June 2014 11:35:12 and PASSED the requirements for a valid MOT with 0 comments.

This test (948491164118) was completed on the 10 June 2014 11:35:12 and PASSED the requirements for a valid MOT with 0 comments.

Recorded mileage: 75,893

Recorded mileage: 75,893


MOT TEST: 09 June 2014 10:16:45 FAILED
MOT TEST: 09 June 2014 10:16:45 FAILED

This test (978370764131) was completed on the 09 June 2014 10:16:45 and FAILED the requirements for a valid MOT with 8 comments.

This test (978370764131) was completed on the 09 June 2014 10:16:45 and FAILED the requirements for a valid MOT with 8 comments.

Recorded mileage: 75,893

Recorded mileage: 75,893


FAIL


MOT TEST: 03 July 2013 13:43:01 PASSED
MOT TEST: 03 July 2013 13:43:01 PASSED

This test (228924583498) was completed on the 03 July 2013 13:43:01 and PASSED the requirements for a valid MOT with 0 comments.

This test (228924583498) was completed on the 03 July 2013 13:43:01 and PASSED the requirements for a valid MOT with 0 comments.

Recorded mileage: 75,217

Recorded mileage: 75,217


MOT TEST: 28 June 2012 09:29:56 PASSED
MOT TEST: 28 June 2012 09:29:56 PASSED

This test (225940882439) was completed on the 28 June 2012 09:29:56 and PASSED the requirements for a valid MOT with 0 comments.

This test (225940882439) was completed on the 28 June 2012 09:29:56 and PASSED the requirements for a valid MOT with 0 comments.

Recorded mileage: 75,190

Recorded mileage: 75,190


MOT TEST: 28 June 2012 09:29:56 FAILED
MOT TEST: 28 June 2012 09:29:56 FAILED

This test (118320582161) was completed on the 28 June 2012 09:29:56 and FAILED the requirements for a valid MOT with 1 comments.

This test (118320582161) was completed on the 28 June 2012 09:29:56 and FAILED the requirements for a valid MOT with 1 comments.

Recorded mileage: 75,190

Recorded mileage: 75,190


PASS WITH RECTIFICATION


MOT TEST: 24 May 2011 08:07:53 PASSED
MOT TEST: 24 May 2011 08:07:53 PASSED

This test (888723041164) was completed on the 24 May 2011 08:07:53 and PASSED the requirements for a valid MOT with 0 comments.

This test (888723041164) was completed on the 24 May 2011 08:07:53 and PASSED the requirements for a valid MOT with 0 comments.

Recorded mileage: 75,118

Recorded mileage: 75,118


MOT TEST: 17 March 2008 14:14:57 PASSED
MOT TEST: 17 March 2008 14:14:57 PASSED

This test (983097878038) was completed on the 17 March 2008 14:14:57 and PASSED the requirements for a valid MOT with 0 comments.

This test (983097878038) was completed on the 17 March 2008 14:14:57 and PASSED the requirements for a valid MOT with 0 comments.

Recorded mileage: 74,624

Recorded mileage: 74,624


MOT TEST: 17 March 2008 13:05:40 FAILED
MOT TEST: 17 March 2008 13:05:40 FAILED

This test (893037578022) was completed on the 17 March 2008 13:05:40 and FAILED the requirements for a valid MOT with 3 comments.

This test (893037578022) was completed on the 17 March 2008 13:05:40 and FAILED the requirements for a valid MOT with 3 comments.

Recorded mileage: 74,624

Recorded mileage: 74,624


FAIL