JDP 235E


JDP235E is registered to a Maroon 1967, Morris Minor 1000 with a Petrol engine. It Failed its most recent MOT Test on the 17 May 2008

13 unique faults (13 Total) reported in its MOT History (3 Tests).

0 common/recurring faults.

67% (2) MOT Pass Rate and a 33% (1) MOT Failure Rate.

30,632 recorded miles.

JDP 235E


JDP235E is registered to a Maroon 1967, Morris Minor 1000 with a Petrol engine. It Failed its most recent MOT Test on the 17 May 2008

13 unique faults (13 Total) reported in its MOT History (3 Tests).

0 common/recurring faults.

67% (2) MOT Pass Rate and a 33% (1) MOT Failure Rate.

30,632 recorded miles.

MOT PASS/Failure rate for JDP 235E

all MOT test results for JDP 235E represented as a percentage
MOT PASS/Failure rate for JDP 235E
all MOT test results for JDP 235E represented as a percentage

PERCENTAGE OF VEHICLE FAULTS WITH JDP 235E

ALL REPORTED FAULTS, DISPLAYED BY PERCENTAGE OF OCCURRENCE DURING ALL MOT TESTS
PERCENTAGE OF VEHICLE FAULTS WITH JDP 235E
ALL REPORTED FAULTS, DISPLAYED BY PERCENTAGE OF OCCURRENCE DURING ALL MOT TESTS
ADVISORY

FAIL

USER ENTERED

JDP 235E annual Faults by type

ALL REPORTED FAULTS, DISPLAYED over time and categorised by type
JDP 235E annual Faults by type
ALL REPORTED FAULTS, DISPLAYED over time and categorised by type

ALL JDP 235E ADVISORIES [1]

ALL ADVISORIES, ORDERED by OCCURRENCE DURING JDP 235E's MOT HISTORY
ALL JDP 235E ADVISORIES [1]
ALL ADVISORIES, ORDERED by OCCURRENCE DURING JDP 235E's MOT HISTORY
Advisory Faults | source www.vehiclestats.co.uk
Fault Fault Test Date Test Date/Time Reference MOT Test Reference
1 Offside front brake hose slightly chafed (3.6.b.4d) Offside front brake hose slightly chafed (3.6.b.4d) 02 May 2006 [15:39] 02/05/2006 291452326440 291452326440

ALL JDP 235E Failure Faults [11]

ALL Failure faults, ORDERED by OCCURRENCE DURING JDP 235E's MOT HISTORY
ALL JDP 235E Failure Faults [11]
ALL Failure faults, ORDERED by OCCURRENCE DURING JDP 235E's MOT HISTORY
Fail Faults | source www.vehiclestats.co.uk
Fault Fault Test Date Test Date/Time Reference MOT Test Reference
1 Registration plate lamp not working (1.1.c.1d) Registration plate lamp not working (1.1.c.1d) 23 March 2007 [10:26] 23/03/2007 120682187070 120682187070
1 Nearside front passenger door cannot be opened from outside the vehicle (6.2.b.1b) Nearside front passenger door cannot be opened from outside the vehicle (6.2.b.1b) 23 March 2007 [10:26] 23/03/2007 120682187070 120682187070
1 Offside rear vehicle structure has excessive corrosion, seriously affecting its strength within 30cm of the body mountings (6.1.b.2) Offside rear vehicle structure has excessive corrosion, seriously affecting its strength within 30cm of the body mountings (6.1.b.2) 23 March 2007 [10:26] 23/03/2007 120682187070 120682187070
1 Nearside rear vehicle structure has excessive corrosion, seriously affecting its strength within 30cm of the body mountings (6.1.b.2) Nearside rear vehicle structure has excessive corrosion, seriously affecting its strength within 30cm of the body mountings (6.1.b.2) 23 March 2007 [10:26] 23/03/2007 120682187070 120682187070
1 Offside rear braking system leaking (3.6.a.1) Offside rear braking system leaking (3.6.a.1) 23 March 2007 [10:26] 23/03/2007 120682187070 120682187070
1 Nearside steering rack gaiter insecure (2.2.d.2d) Nearside steering rack gaiter insecure (2.2.d.2d) 23 March 2007 [10:26] 23/03/2007 120682187070 120682187070
1 Offside upper steering pivot point has excessive play (2.2.b.1g) Offside upper steering pivot point has excessive play (2.2.b.1g) 23 March 2007 [10:26] 23/03/2007 120682187070 120682187070
1 Brake pipe inadequately supported (3.6.b.1) Brake pipe inadequately supported (3.6.b.1) 23 March 2007 [10:26] 23/03/2007 120682187070 120682187070
1 Offside rear suspension spring mounting prescribed area is inadequately repaired (2.4.a.3) Offside rear suspension spring mounting prescribed area is inadequately repaired (2.4.a.3) 23 March 2007 [10:26] 23/03/2007 120682187070 120682187070
1 Service brake: efficiency below requirements (3.7.b.7) Service brake: efficiency below requirements (3.7.b.7) 23 March 2007 [10:26] 23/03/2007 120682187070 120682187070
1 Parking brake: efficiency below requirements (3.7.b.7) Parking brake: efficiency below requirements (3.7.b.7) 23 March 2007 [10:26] 23/03/2007 120682187070 120682187070

ALL JDP 235E User Entered Faults [1]

ALL User Entered faults, ORDERED by OCCURRENCE DURING JDP 235E's MOT HISTORY
ALL JDP 235E User Entered Faults [1]
ALL User Entered faults, ORDERED by OCCURRENCE DURING JDP 235E's MOT HISTORY
Fail Faults | source www.vehiclestats.co.uk
Fault Fault Test Date Test Date/Time Reference MOT Test Reference
1 Nearside doorpost weakened through rust Nearside doorpost weakened through rust 23 March 2007 [10:26] 23/03/2007 120682187070 120682187070

MOT TEST: 17 May 2008 10:33:17 PASSED
MOT TEST: 17 May 2008 10:33:17 PASSED

This test (644938038157) was completed on the 17 May 2008 10:33:17 and PASSED the requirements for a valid MOT with 0 comments.

This test (644938038157) was completed on the 17 May 2008 10:33:17 and PASSED the requirements for a valid MOT with 0 comments.

Recorded mileage: 30,631

Recorded mileage: 30,631


MOT TEST: 23 March 2007 10:26:56 FAILED
MOT TEST: 23 March 2007 10:26:56 FAILED

This test (120682187070) was completed on the 23 March 2007 10:26:56 and FAILED the requirements for a valid MOT with 12 comments.

This test (120682187070) was completed on the 23 March 2007 10:26:56 and FAILED the requirements for a valid MOT with 12 comments.

Recorded mileage: 30,632

Recorded mileage: 30,632


FAIL

USER ENTERED


MOT TEST: 02 May 2006 15:39:05 PASSED
MOT TEST: 02 May 2006 15:39:05 PASSED

This test (291452326440) was completed on the 02 May 2006 15:39:05 and PASSED the requirements for a valid MOT with 1 comments.

This test (291452326440) was completed on the 02 May 2006 15:39:05 and PASSED the requirements for a valid MOT with 1 comments.

Recorded mileage: 23,814

Recorded mileage: 23,814


ADVISORY