JEN25


JEN25 is registered to a Maroon 1971, Morris Minor 1000 with a Petrol engine. It Passed its most recent MOT Test on the 13 October 2018

23 unique faults (29 Total) reported in its MOT History (13 Tests).

6 common/recurring faults, the most frequent (2 times) is: Nearside Rear Leaf spring has slight side play at eye (anchor) (2.4.B.4).

77% (10) MOT Pass Rate and a 23% (3) MOT Failure Rate.

48,830 recorded miles.

JEN25


JEN25 is registered to a Maroon 1971, Morris Minor 1000 with a Petrol engine. It Passed its most recent MOT Test on the 13 October 2018

23 unique faults (29 Total) reported in its MOT History (13 Tests).

6 common/recurring faults, the most frequent (2 times) is: Nearside Rear Leaf spring has slight side play at eye (anchor) (2.4.B.4).

77% (10) MOT Pass Rate and a 23% (3) MOT Failure Rate.

48,830 recorded miles.

MOT PASS/Failure rate for JEN25

all MOT test results for JEN25 represented as a percentage
MOT PASS/Failure rate for JEN25
all MOT test results for JEN25 represented as a percentage

PERCENTAGE OF VEHICLE FAULTS WITH JEN25

ALL REPORTED FAULTS, DISPLAYED BY PERCENTAGE OF OCCURRENCE DURING ALL MOT TESTS
PERCENTAGE OF VEHICLE FAULTS WITH JEN25
ALL REPORTED FAULTS, DISPLAYED BY PERCENTAGE OF OCCURRENCE DURING ALL MOT TESTS
ADVISORY

FAIL

JEN25 annual Faults by type

ALL REPORTED FAULTS, DISPLAYED over time and categorised by type
JEN25 annual Faults by type
ALL REPORTED FAULTS, DISPLAYED over time and categorised by type

RECURRING FAULTS WITH JEN25

FAULTS THAT HAVE OCCURED MORE THAN ONCE DURING JEN25's MOT HISTORY
RECURRING FAULTS WITH JEN25
FAULTS THAT HAVE OCCURED MORE THAN ONCE DURING JEN25's MOT HISTORY
Fault Fault Test Date Test Date/Time Reference MOT Test Reference
2 Nearside rear leaf spring has slight side play at eye (anchor) (2.4.b.4) Nearside rear leaf spring has slight side play at eye (anchor) (2.4.b.4) 30 June 2016 [13:42] 30/06/2016 22 June 2016 [13:45] 22/06/2016 596568044287 596568044287 963843379437 963843379437
2 Offside rear leaf spring has slight side play at eye (anchor) (2.4.b.4) Offside rear leaf spring has slight side play at eye (anchor) (2.4.b.4) 30 June 2016 [13:42] 30/06/2016 22 June 2016 [13:45] 22/06/2016 596568044287 596568044287 963843379437 963843379437
2 Nearside front leaf spring has slight side play at eye (anchor) (2.4.b.4) Nearside front leaf spring has slight side play at eye (anchor) (2.4.b.4) 30 June 2016 [13:42] 30/06/2016 22 June 2016 [13:45] 22/06/2016 596568044287 596568044287 963843379437 963843379437
2 Offside front leaf spring has slight side play at eye (anchor) (2.4.b.4) Offside front leaf spring has slight side play at eye (anchor) (2.4.b.4) 30 June 2016 [13:42] 30/06/2016 22 June 2016 [13:45] 22/06/2016 596568044287 596568044287 963843379437 963843379437
2 Nearside rear leaf spring has slight side play at eye (shackle) (2.4.b.4) Nearside rear leaf spring has slight side play at eye (shackle) (2.4.b.4) 30 June 2016 [13:42] 30/06/2016 22 June 2016 [13:45] 22/06/2016 596568044287 596568044287 963843379437 963843379437
2 Offside rear leaf spring has slight side play at eye (shackle) (2.4.b.4) Offside rear leaf spring has slight side play at eye (shackle) (2.4.b.4) 30 June 2016 [13:42] 30/06/2016 22 June 2016 [13:45] 22/06/2016 596568044287 596568044287 963843379437 963843379437

ALL JEN25 ADVISORIES [17]

ALL ADVISORIES, ORDERED by OCCURRENCE DURING JEN25's MOT HISTORY
ALL JEN25 ADVISORIES [17]
ALL ADVISORIES, ORDERED by OCCURRENCE DURING JEN25's MOT HISTORY
Advisory Faults | source www.vehiclestats.co.uk
Fault Fault Test Date Test Date/Time Reference MOT Test Reference
2 Nearside rear leaf spring has slight side play at eye (anchor) (2.4.b.4) Nearside rear leaf spring has slight side play at eye (anchor) (2.4.b.4) 30 June 2016 [13:42] 30/06/2016 22 June 2016 [13:45] 22/06/2016 596568044287 596568044287 963843379437 963843379437
2 Offside rear leaf spring has slight side play at eye (anchor) (2.4.b.4) Offside rear leaf spring has slight side play at eye (anchor) (2.4.b.4) 30 June 2016 [13:42] 30/06/2016 22 June 2016 [13:45] 22/06/2016 596568044287 596568044287 963843379437 963843379437
2 Nearside front leaf spring has slight side play at eye (anchor) (2.4.b.4) Nearside front leaf spring has slight side play at eye (anchor) (2.4.b.4) 30 June 2016 [13:42] 30/06/2016 22 June 2016 [13:45] 22/06/2016 596568044287 596568044287 963843379437 963843379437
2 Offside front leaf spring has slight side play at eye (anchor) (2.4.b.4) Offside front leaf spring has slight side play at eye (anchor) (2.4.b.4) 30 June 2016 [13:42] 30/06/2016 22 June 2016 [13:45] 22/06/2016 596568044287 596568044287 963843379437 963843379437
2 Nearside rear leaf spring has slight side play at eye (shackle) (2.4.b.4) Nearside rear leaf spring has slight side play at eye (shackle) (2.4.b.4) 30 June 2016 [13:42] 30/06/2016 22 June 2016 [13:45] 22/06/2016 596568044287 596568044287 963843379437 963843379437
2 Offside rear leaf spring has slight side play at eye (shackle) (2.4.b.4) Offside rear leaf spring has slight side play at eye (shackle) (2.4.b.4) 30 June 2016 [13:42] 30/06/2016 22 June 2016 [13:45] 22/06/2016 596568044287 596568044287 963843379437 963843379437
1 Nearside front brake hose slightly deteriorated (3.6.b.4d) Nearside front brake hose slightly deteriorated (3.6.b.4d) 28 June 2012 [12:37] 28/06/2012 129870882140 129870882140
1 Offside front wheel bearing has slight play (2.5.a.3c) Offside front wheel bearing has slight play (2.5.a.3c) 28 June 2012 [12:37] 28/06/2012 129870882140 129870882140
1 Nearside rear suspension spring mounting prescribed area is corroded but not considered excessive (2.4.a.3) Nearside rear suspension spring mounting prescribed area is corroded but not considered excessive (2.4.a.3) 22 June 2011 [09:08] 22/06/2011 996613671105 996613671105
1 Offside rear suspension spring mounting prescribed area is corroded but not considered excessive (2.4.a.3) Offside rear suspension spring mounting prescribed area is corroded but not considered excessive (2.4.a.3) 22 June 2011 [09:08] 22/06/2011 996613671105 996613671105
1 Offside front vehicle structure has slight corrosion (6.1.b.2) Offside front vehicle structure has slight corrosion (6.1.b.2) 30 July 2008 [13:28] 30/07/2008 370202418285 370202418285

ALL JEN25 Failure Faults [12]

ALL Failure faults, ORDERED by OCCURRENCE DURING JEN25's MOT HISTORY
ALL JEN25 Failure Faults [12]
ALL Failure faults, ORDERED by OCCURRENCE DURING JEN25's MOT HISTORY
Fail Faults | source www.vehiclestats.co.uk
Fault Fault Test Date Test Date/Time Reference MOT Test Reference
1 Parking brake: efficiency below requirements (3.7.b.7) Parking brake: efficiency below requirements (3.7.b.7) 22 June 2016 [13:45] 22/06/2016 963843379437 963843379437
1 Exhaust has a major leak of exhaust gases (7.1.2) Exhaust has a major leak of exhaust gases (7.1.2) 22 June 2016 [13:45] 22/06/2016 963843379437 963843379437
1 Offside front lower suspension arm corroded and seriously weakened (2.4.g.1) Offside front lower suspension arm corroded and seriously weakened (2.4.g.1) 22 June 2016 [13:45] 22/06/2016 963843379437 963843379437
1 Nearside front vehicle structure has excessive corrosion, seriously affecting its strength within 30cm of the body mountings (6.1.b.2) Nearside front vehicle structure has excessive corrosion, seriously affecting its strength within 30cm of the body mountings (6.1.b.2) 22 June 2016 [13:45] 22/06/2016 963843379437 963843379437
1 Rear brake hose twisted (3.6.b.4c) Rear brake hose twisted (3.6.b.4c) 22 June 2016 [13:45] 22/06/2016 963843379437 963843379437
1 Front windscreen wiper not operating automatically when switched on (8.2.1b) Front windscreen wiper not operating automatically when switched on (8.2.1b) 28 June 2012 [12:37] 28/06/2012 129870882140 129870882140
1 Nearside front position lamp(s) not working (1.1.a.3b) Nearside front position lamp(s) not working (1.1.a.3b) 28 June 2012 [12:37] 28/06/2012 129870882140 129870882140
1 Offside rear seat belt retracting mechanism defective (5.2.5b) Offside rear seat belt retracting mechanism defective (5.2.5b) 28 June 2012 [12:37] 28/06/2012 129870882140 129870882140
1 Offside outer rear vehicle structure has excessive corrosion, seriously affecting its strength within 30cm of the body mountings (6.1.b.2) Offside outer rear vehicle structure has excessive corrosion, seriously affecting its strength within 30cm of the body mountings (6.1.b.2) 28 June 2012 [12:37] 28/06/2012 129870882140 129870882140
1 Offside front brake hose excessively deteriorated (3.6.b.4d) Offside front brake hose excessively deteriorated (3.6.b.4d) 28 June 2012 [12:37] 28/06/2012 129870882140 129870882140
1 Nearside front upper suspension arm has excessive play in a pin/bearing (2.4.g.2) Nearside front upper suspension arm has excessive play in a pin/bearing (2.4.g.2) 04 July 2007 [13:42] 04/07/2007 790885887176 790885887176
1 Offside rear vehicle structure has excessive corrosion which adversely affects braking or steering (6.1.a.1) Offside rear vehicle structure has excessive corrosion which adversely affects braking or steering (6.1.a.1) 04 July 2007 [13:42] 04/07/2007 790885887176 790885887176

MOT TEST: 13 October 2018 07:23:09 PASSED
MOT TEST: 13 October 2018 07:23:09 PASSED

This test (230002342619) was completed on the 13 October 2018 07:23:09 and PASSED the requirements for a valid MOT with 0 comments.

This test (230002342619) was completed on the 13 October 2018 07:23:09 and PASSED the requirements for a valid MOT with 0 comments.

Recorded mileage: 48,830

Recorded mileage: 48,830


MOT TEST: 12 June 2017 15:42:32 PASSED
MOT TEST: 12 June 2017 15:42:32 PASSED

This test (732070508574) was completed on the 12 June 2017 15:42:32 and PASSED the requirements for a valid MOT with 0 comments.

This test (732070508574) was completed on the 12 June 2017 15:42:32 and PASSED the requirements for a valid MOT with 0 comments.

Recorded mileage: 45,682

Recorded mileage: 45,682


MOT TEST: 30 June 2016 13:42:20 PASSED
MOT TEST: 30 June 2016 13:42:20 PASSED

This test (596568044287) was completed on the 30 June 2016 13:42:20 and PASSED the requirements for a valid MOT with 6 comments.

This test (596568044287) was completed on the 30 June 2016 13:42:20 and PASSED the requirements for a valid MOT with 6 comments.

Recorded mileage: 44,931

Recorded mileage: 44,931


ADVISORY


MOT TEST: 22 June 2016 13:45:02 FAILED
MOT TEST: 22 June 2016 13:45:02 FAILED

This test (963843379437) was completed on the 22 June 2016 13:45:02 and FAILED the requirements for a valid MOT with 11 comments.

This test (963843379437) was completed on the 22 June 2016 13:45:02 and FAILED the requirements for a valid MOT with 11 comments.

Recorded mileage: 44,929

Recorded mileage: 44,929


ADVISORY

FAIL


MOT TEST: 17 June 2015 11:58:26 PASSED
MOT TEST: 17 June 2015 11:58:26 PASSED

This test (215068165163) was completed on the 17 June 2015 11:58:26 and PASSED the requirements for a valid MOT with 0 comments.

This test (215068165163) was completed on the 17 June 2015 11:58:26 and PASSED the requirements for a valid MOT with 0 comments.

Recorded mileage: 44,011

Recorded mileage: 44,011


MOT TEST: 20 August 2013 10:26:56 PASSED
MOT TEST: 20 August 2013 10:26:56 PASSED

This test (419622433275) was completed on the 20 August 2013 10:26:56 and PASSED the requirements for a valid MOT with 0 comments.

This test (419622433275) was completed on the 20 August 2013 10:26:56 and PASSED the requirements for a valid MOT with 0 comments.

Recorded mileage: 43,203

Recorded mileage: 43,203


MOT TEST: 16 July 2012 12:44:55 PASSED
MOT TEST: 16 July 2012 12:44:55 PASSED

This test (805738392133) was completed on the 16 July 2012 12:44:55 and PASSED the requirements for a valid MOT with 0 comments.

This test (805738392133) was completed on the 16 July 2012 12:44:55 and PASSED the requirements for a valid MOT with 0 comments.

Recorded mileage: 41,831

Recorded mileage: 41,831


MOT TEST: 28 June 2012 12:37:47 FAILED
MOT TEST: 28 June 2012 12:37:47 FAILED

This test (129870882140) was completed on the 28 June 2012 12:37:47 and FAILED the requirements for a valid MOT with 7 comments.

This test (129870882140) was completed on the 28 June 2012 12:37:47 and FAILED the requirements for a valid MOT with 7 comments.

Recorded mileage: 41,796

Recorded mileage: 41,796


ADVISORY

FAIL


MOT TEST: 22 June 2011 09:08:47 PASSED
MOT TEST: 22 June 2011 09:08:47 PASSED

This test (996613671105) was completed on the 22 June 2011 09:08:47 and PASSED the requirements for a valid MOT with 2 comments.

This test (996613671105) was completed on the 22 June 2011 09:08:47 and PASSED the requirements for a valid MOT with 2 comments.

Recorded mileage: 40,778

Recorded mileage: 40,778


ADVISORY


MOT TEST: 05 August 2009 12:18:24 PASSED
MOT TEST: 05 August 2009 12:18:24 PASSED

This test (962107619292) was completed on the 05 August 2009 12:18:24 and PASSED the requirements for a valid MOT with 0 comments.

This test (962107619292) was completed on the 05 August 2009 12:18:24 and PASSED the requirements for a valid MOT with 0 comments.

Recorded mileage: 37,982

Recorded mileage: 37,982


MOT TEST: 30 July 2008 13:28:23 PASSED
MOT TEST: 30 July 2008 13:28:23 PASSED

This test (370202418285) was completed on the 30 July 2008 13:28:23 and PASSED the requirements for a valid MOT with 1 comments.

This test (370202418285) was completed on the 30 July 2008 13:28:23 and PASSED the requirements for a valid MOT with 1 comments.

Recorded mileage: 37,481

Recorded mileage: 37,481


ADVISORY


MOT TEST: 10 July 2007 13:33:41 PASSED
MOT TEST: 10 July 2007 13:33:41 PASSED

This test (540521597134) was completed on the 10 July 2007 13:33:41 and PASSED the requirements for a valid MOT with 0 comments.

This test (540521597134) was completed on the 10 July 2007 13:33:41 and PASSED the requirements for a valid MOT with 0 comments.

Recorded mileage: 37,011

Recorded mileage: 37,011


MOT TEST: 04 July 2007 13:42:21 FAILED
MOT TEST: 04 July 2007 13:42:21 FAILED

This test (790885887176) was completed on the 04 July 2007 13:42:21 and FAILED the requirements for a valid MOT with 2 comments.

This test (790885887176) was completed on the 04 July 2007 13:42:21 and FAILED the requirements for a valid MOT with 2 comments.

Recorded mileage: 37,003

Recorded mileage: 37,003


FAIL