JEN 906G


JEN906G is registered to a Green 1968, Morris Minor 1000 with a Petrol engine. It Passed its most recent MOT Test on the 04 April 2018

18 unique faults (24 Total) reported in its MOT History (20 Tests).

5 common/recurring faults, the most frequent (3 times) is: Parking brake: efficiency below requirements (3.7.B.7).

65% (13) MOT Pass Rate and a 35% (7) MOT Failure Rate.

40,865 recorded miles.

JEN 906G


JEN906G is registered to a Green 1968, Morris Minor 1000 with a Petrol engine. It Passed its most recent MOT Test on the 04 April 2018

18 unique faults (24 Total) reported in its MOT History (20 Tests).

5 common/recurring faults, the most frequent (3 times) is: Parking brake: efficiency below requirements (3.7.B.7).

65% (13) MOT Pass Rate and a 35% (7) MOT Failure Rate.

40,865 recorded miles.

MOT PASS/Failure rate for JEN 906G

all MOT test results for JEN 906G represented as a percentage
MOT PASS/Failure rate for JEN 906G
all MOT test results for JEN 906G represented as a percentage

PERCENTAGE OF VEHICLE FAULTS WITH JEN 906G

ALL REPORTED FAULTS, DISPLAYED BY PERCENTAGE OF OCCURRENCE DURING ALL MOT TESTS
PERCENTAGE OF VEHICLE FAULTS WITH JEN 906G
ALL REPORTED FAULTS, DISPLAYED BY PERCENTAGE OF OCCURRENCE DURING ALL MOT TESTS
FAIL

PASS WITH RECTIFICATION

JEN 906G annual Faults by type

ALL REPORTED FAULTS, DISPLAYED over time and categorised by type
JEN 906G annual Faults by type
ALL REPORTED FAULTS, DISPLAYED over time and categorised by type

RECURRING FAULTS WITH JEN 906G

FAULTS THAT HAVE OCCURED MORE THAN ONCE DURING JEN 906G's MOT HISTORY
RECURRING FAULTS WITH JEN 906G
FAULTS THAT HAVE OCCURED MORE THAN ONCE DURING JEN 906G's MOT HISTORY
Fault Fault Test Date Test Date/Time Reference MOT Test Reference
3 Parking brake: efficiency below requirements (3.7.b.7) Parking brake: efficiency below requirements (3.7.b.7) 04 April 2013 [16:57] 04/04/2013 16 May 2011 [11:52] 16/05/2011 18 May 2006 [12:10] 18/05/2006 146894193067 146894193067 499036331107 499036331107 874588036113 874588036113
2 Front brake application uneven (3.7.b.2) Front brake application uneven (3.7.b.2) 24 March 2015 [12:17] 24/03/2015 16 May 2011 [11:52] 16/05/2011 428193185005 428193185005 499036331107 499036331107
2 Indicator tell tale inoperative (1.4.a.2a) Indicator tell tale inoperative (1.4.a.2a) 10 April 2014 [11:56] 10/04/2014 04 April 2013 [16:57] 04/04/2013 907240304111 907240304111 146894193067 146894193067
2 Nearside rear parking brake recording little or no effort (3.7.b.6a) Nearside rear parking brake recording little or no effort (3.7.b.6a) 04 April 2013 [16:57] 04/04/2013 16 May 2011 [11:52] 16/05/2011 146894193067 146894193067 499036331107 499036331107
2 Brakes imbalanced across an axle (3.7.b.5b) Brakes imbalanced across an axle (3.7.b.5b) 12 June 2012 [17:20] 12/06/2012 16 May 2011 [11:52] 16/05/2011 249244262449 249244262449 499036331107 499036331107

ALL JEN 906G Failure Faults [23]

ALL Failure faults, ORDERED by OCCURRENCE DURING JEN 906G's MOT HISTORY
ALL JEN 906G Failure Faults [23]
ALL Failure faults, ORDERED by OCCURRENCE DURING JEN 906G's MOT HISTORY
Fail Faults | source www.vehiclestats.co.uk
Fault Fault Test Date Test Date/Time Reference MOT Test Reference
3 Parking brake: efficiency below requirements (3.7.b.7) Parking brake: efficiency below requirements (3.7.b.7) 04 April 2013 [16:57] 04/04/2013 16 May 2011 [11:52] 16/05/2011 18 May 2006 [12:10] 18/05/2006 146894193067 146894193067 499036331107 499036331107 874588036113 874588036113
2 Front brake application uneven (3.7.b.2) Front brake application uneven (3.7.b.2) 24 March 2015 [12:17] 24/03/2015 16 May 2011 [11:52] 16/05/2011 428193185005 428193185005 499036331107 499036331107
2 Nearside rear parking brake recording little or no effort (3.7.b.6a) Nearside rear parking brake recording little or no effort (3.7.b.6a) 04 April 2013 [16:57] 04/04/2013 16 May 2011 [11:52] 16/05/2011 146894193067 146894193067 499036331107 499036331107
2 Brakes imbalanced across an axle (3.7.b.5b) Brakes imbalanced across an axle (3.7.b.5b) 12 June 2012 [17:20] 12/06/2012 16 May 2011 [11:52] 16/05/2011 249244262449 249244262449 499036331107 499036331107
1 Offside rear suspension spring mounting prescribed area is excessively corroded inner arch/floor/chassis rail (2.4.a.3) Offside rear suspension spring mounting prescribed area is excessively corroded inner arch/floor/chassis rail (2.4.a.3) 19 March 2018 [09:48] 19/03/2018 683772562262 683772562262
1 Offside front suspension spring mounting prescribed area is excessively corroded sill/inner arch (2.4.a.3) Offside front suspension spring mounting prescribed area is excessively corroded sill/inner arch (2.4.a.3) 19 March 2018 [09:48] 19/03/2018 683772562262 683772562262
1 Nearside front suspension spring mounting prescribed area is excessively corroded inner arch (2.4.a.3) Nearside front suspension spring mounting prescribed area is excessively corroded inner arch (2.4.a.3) 19 March 2018 [09:48] 19/03/2018 683772562262 683772562262
1 Nearside rear suspension spring mounting prescribed area is excessively corroded inner arch (2.4.a.3) Nearside rear suspension spring mounting prescribed area is excessively corroded inner arch (2.4.a.3) 19 March 2018 [09:48] 19/03/2018 683772562262 683772562262
1 Offside track rod end ball joint has excessive play (2.2.b.1f) Offside track rod end ball joint has excessive play (2.2.b.1f) 24 March 2015 [12:17] 24/03/2015 428193185005 428193185005
1 Offside rear suspension spring mounting prescribed area is excessively corroded (2.4.a.3) Offside rear suspension spring mounting prescribed area is excessively corroded (2.4.a.3) 24 March 2015 [12:17] 24/03/2015 428193185005 428193185005
1 Indicator tell tale inoperative (1.4.a.2a) Indicator tell tale inoperative (1.4.a.2a) 04 April 2013 [16:57] 04/04/2013 146894193067 146894193067
1 Horn not working (1.6.2a) Horn not working (1.6.2a) 12 June 2012 [17:20] 12/06/2012 249244262449 249244262449
1 Centre registration plate lamp not working (1.1.c.1d) Centre registration plate lamp not working (1.1.c.1d) 12 June 2012 [17:20] 12/06/2012 249244262449 249244262449
1 Nearside front position lamp(s) not working (1.1.a.3b) Nearside front position lamp(s) not working (1.1.a.3b) 16 May 2011 [11:52] 16/05/2011 499036331107 499036331107
1 Offside front position lamp(s) not working (1.1.a.3b) Offside front position lamp(s) not working (1.1.a.3b) 16 May 2011 [11:52] 16/05/2011 499036331107 499036331107
1 Offside front brake recording little or no effort (3.7.b.5a) Offside front brake recording little or no effort (3.7.b.5a) 16 May 2011 [11:52] 16/05/2011 499036331107 499036331107
1 Offside rear parking brake recording little or no effort (3.7.b.6a) Offside rear parking brake recording little or no effort (3.7.b.6a) 16 May 2011 [11:52] 16/05/2011 499036331107 499036331107
1 Nearside front lower seat belt anchorage prescribed area is excessively corroded (5.2.6) Nearside front lower seat belt anchorage prescribed area is excessively corroded (5.2.6) 16 May 2011 [11:52] 16/05/2011 499036331107 499036331107

ALL JEN 906G Pass With Rectification Faults [1]

ALL Pass With Rectification faults, ORDERED by OCCURRENCE DURING JEN 906G's MOT HISTORY
ALL JEN 906G Pass With Rectification Faults [1]
ALL Pass With Rectification faults, ORDERED by OCCURRENCE DURING JEN 906G's MOT HISTORY
Pass With Rectification Faults | source www.vehiclestats.co.uk
Fault Fault Test Date Test Date/Time Reference MOT Test Reference
1 Indicator tell tale inoperative (1.4.a.2a) Indicator tell tale inoperative (1.4.a.2a) 10 April 2014 [11:56] 10/04/2014 907240304111 907240304111

MOT TEST: 04 April 2018 08:09:05 PASSED
MOT TEST: 04 April 2018 08:09:05 PASSED

This test (117036021618) was completed on the 04 April 2018 08:09:05 and PASSED the requirements for a valid MOT with 0 comments.

This test (117036021618) was completed on the 04 April 2018 08:09:05 and PASSED the requirements for a valid MOT with 0 comments.

Recorded mileage: 40,865

Recorded mileage: 40,865


MOT TEST: 19 March 2018 09:48:17 FAILED
MOT TEST: 19 March 2018 09:48:17 FAILED

This test (683772562262) was completed on the 19 March 2018 09:48:17 and FAILED the requirements for a valid MOT with 4 comments.

This test (683772562262) was completed on the 19 March 2018 09:48:17 and FAILED the requirements for a valid MOT with 4 comments.

Recorded mileage: 40,864

Recorded mileage: 40,864


FAIL


MOT TEST: 30 March 2017 09:05:21 PASSED
MOT TEST: 30 March 2017 09:05:21 PASSED

This test (482397609334) was completed on the 30 March 2017 09:05:21 and PASSED the requirements for a valid MOT with 0 comments.

This test (482397609334) was completed on the 30 March 2017 09:05:21 and PASSED the requirements for a valid MOT with 0 comments.

Recorded mileage: 37,726

Recorded mileage: 37,726


MOT TEST: 14 March 2016 12:01:30 PASSED
MOT TEST: 14 March 2016 12:01:30 PASSED

This test (943249473339) was completed on the 14 March 2016 12:01:30 and PASSED the requirements for a valid MOT with 0 comments.

This test (943249473339) was completed on the 14 March 2016 12:01:30 and PASSED the requirements for a valid MOT with 0 comments.

Recorded mileage: 34,740

Recorded mileage: 34,740


MOT TEST: 27 March 2015 16:09:28 PASSED
MOT TEST: 27 March 2015 16:09:28 PASSED

This test (489726185037) was completed on the 27 March 2015 16:09:28 and PASSED the requirements for a valid MOT with 0 comments.

This test (489726185037) was completed on the 27 March 2015 16:09:28 and PASSED the requirements for a valid MOT with 0 comments.

Recorded mileage: 31,394

Recorded mileage: 31,394


MOT TEST: 24 March 2015 12:17:45 FAILED
MOT TEST: 24 March 2015 12:17:45 FAILED

This test (428193185005) was completed on the 24 March 2015 12:17:45 and FAILED the requirements for a valid MOT with 3 comments.

This test (428193185005) was completed on the 24 March 2015 12:17:45 and FAILED the requirements for a valid MOT with 3 comments.

Recorded mileage: 31,388

Recorded mileage: 31,388


FAIL


MOT TEST: 10 April 2014 11:56:24 PASSED
MOT TEST: 10 April 2014 11:56:24 PASSED

This test (215040004121) was completed on the 10 April 2014 11:56:24 and PASSED the requirements for a valid MOT with 0 comments.

This test (215040004121) was completed on the 10 April 2014 11:56:24 and PASSED the requirements for a valid MOT with 0 comments.

Recorded mileage: 29,547

Recorded mileage: 29,547


MOT TEST: 10 April 2014 11:56:24 FAILED
MOT TEST: 10 April 2014 11:56:24 FAILED

This test (907240304111) was completed on the 10 April 2014 11:56:24 and FAILED the requirements for a valid MOT with 1 comments.

This test (907240304111) was completed on the 10 April 2014 11:56:24 and FAILED the requirements for a valid MOT with 1 comments.

Recorded mileage: 29,547

Recorded mileage: 29,547


PASS WITH RECTIFICATION


MOT TEST: 08 April 2013 12:23:52 PASSED
MOT TEST: 08 April 2013 12:23:52 PASSED

This test (555118593011) was completed on the 08 April 2013 12:23:52 and PASSED the requirements for a valid MOT with 0 comments.

This test (555118593011) was completed on the 08 April 2013 12:23:52 and PASSED the requirements for a valid MOT with 0 comments.

Recorded mileage: 27,170

Recorded mileage: 27,170


MOT TEST: 04 April 2013 16:57:58 FAILED
MOT TEST: 04 April 2013 16:57:58 FAILED

This test (146894193067) was completed on the 04 April 2013 16:57:58 and FAILED the requirements for a valid MOT with 3 comments.

This test (146894193067) was completed on the 04 April 2013 16:57:58 and FAILED the requirements for a valid MOT with 3 comments.

Recorded mileage: 27,164

Recorded mileage: 27,164


FAIL


MOT TEST: 13 June 2012 12:40:19 PASSED
MOT TEST: 13 June 2012 12:40:19 PASSED

This test (168405762144) was completed on the 13 June 2012 12:40:19 and PASSED the requirements for a valid MOT with 0 comments.

This test (168405762144) was completed on the 13 June 2012 12:40:19 and PASSED the requirements for a valid MOT with 0 comments.

Recorded mileage: 25,595

Recorded mileage: 25,595


MOT TEST: 12 June 2012 17:20:57 FAILED
MOT TEST: 12 June 2012 17:20:57 FAILED

This test (249244262449) was completed on the 12 June 2012 17:20:57 and FAILED the requirements for a valid MOT with 3 comments.

This test (249244262449) was completed on the 12 June 2012 17:20:57 and FAILED the requirements for a valid MOT with 3 comments.

Recorded mileage: 25,589

Recorded mileage: 25,589


FAIL


MOT TEST: 18 May 2011 11:39:45 PASSED
MOT TEST: 18 May 2011 11:39:45 PASSED

This test (517288331112) was completed on the 18 May 2011 11:39:45 and PASSED the requirements for a valid MOT with 0 comments.

This test (517288331112) was completed on the 18 May 2011 11:39:45 and PASSED the requirements for a valid MOT with 0 comments.

Recorded mileage: 23,328

Recorded mileage: 23,328


MOT TEST: 16 May 2011 11:52:07 FAILED
MOT TEST: 16 May 2011 11:52:07 FAILED

This test (499036331107) was completed on the 16 May 2011 11:52:07 and FAILED the requirements for a valid MOT with 9 comments.

This test (499036331107) was completed on the 16 May 2011 11:52:07 and FAILED the requirements for a valid MOT with 9 comments.

Recorded mileage: 23,322

Recorded mileage: 23,322


FAIL


MOT TEST: 17 May 2010 11:06:36 PASSED
MOT TEST: 17 May 2010 11:06:36 PASSED

This test (300517330129) was completed on the 17 May 2010 11:06:36 and PASSED the requirements for a valid MOT with 0 comments.

This test (300517330129) was completed on the 17 May 2010 11:06:36 and PASSED the requirements for a valid MOT with 0 comments.

Recorded mileage: 21,010

Recorded mileage: 21,010


MOT TEST: 29 April 2009 09:18:05 PASSED
MOT TEST: 29 April 2009 09:18:05 PASSED

This test (312289619159) was completed on the 29 April 2009 09:18:05 and PASSED the requirements for a valid MOT with 0 comments.

This test (312289619159) was completed on the 29 April 2009 09:18:05 and PASSED the requirements for a valid MOT with 0 comments.

Recorded mileage: 19,512

Recorded mileage: 19,512


MOT TEST: 12 May 2008 11:40:07 PASSED
MOT TEST: 12 May 2008 11:40:07 PASSED

This test (170123038153) was completed on the 12 May 2008 11:40:07 and PASSED the requirements for a valid MOT with 0 comments.

This test (170123038153) was completed on the 12 May 2008 11:40:07 and PASSED the requirements for a valid MOT with 0 comments.

Recorded mileage: 17,531

Recorded mileage: 17,531


MOT TEST: 15 May 2007 09:48:31 PASSED
MOT TEST: 15 May 2007 09:48:31 PASSED

This test (420725137104) was completed on the 15 May 2007 09:48:31 and PASSED the requirements for a valid MOT with 0 comments.

This test (420725137104) was completed on the 15 May 2007 09:48:31 and PASSED the requirements for a valid MOT with 0 comments.

Recorded mileage: 15,542

Recorded mileage: 15,542


MOT TEST: 18 May 2006 12:27:50 PASSED
MOT TEST: 18 May 2006 12:27:50 PASSED

This test (250838836171) was completed on the 18 May 2006 12:27:50 and PASSED the requirements for a valid MOT with 0 comments.

This test (250838836171) was completed on the 18 May 2006 12:27:50 and PASSED the requirements for a valid MOT with 0 comments.

Recorded mileage: 13,467

Recorded mileage: 13,467


MOT TEST: 18 May 2006 12:10:02 FAILED
MOT TEST: 18 May 2006 12:10:02 FAILED

This test (874588036113) was completed on the 18 May 2006 12:10:02 and FAILED the requirements for a valid MOT with 1 comments.

This test (874588036113) was completed on the 18 May 2006 12:10:02 and FAILED the requirements for a valid MOT with 1 comments.

Recorded mileage: 13,467

Recorded mileage: 13,467


FAIL