JEO 600H


JEO600H is registered to a Blue 1970, Morris Minor 1000 with a Petrol engine. It Failed its most recent MOT Test on the 17 October 2017

32 unique faults (41 Total) reported in its MOT History (18 Tests).

5 common/recurring faults, the most frequent (4 times) is: Offside Headlamp not working on dipped beam (1.7.5a).

61% (11) MOT Pass Rate and a 39% (7) MOT Failure Rate.

42,217 recorded miles.

JEO 600H


JEO600H is registered to a Blue 1970, Morris Minor 1000 with a Petrol engine. It Failed its most recent MOT Test on the 17 October 2017

32 unique faults (41 Total) reported in its MOT History (18 Tests).

5 common/recurring faults, the most frequent (4 times) is: Offside Headlamp not working on dipped beam (1.7.5a).

61% (11) MOT Pass Rate and a 39% (7) MOT Failure Rate.

42,217 recorded miles.

MOT PASS/Failure rate for JEO 600H

all MOT test results for JEO 600H represented as a percentage
MOT PASS/Failure rate for JEO 600H
all MOT test results for JEO 600H represented as a percentage

PERCENTAGE OF VEHICLE FAULTS WITH JEO 600H

ALL REPORTED FAULTS, DISPLAYED BY PERCENTAGE OF OCCURRENCE DURING ALL MOT TESTS
PERCENTAGE OF VEHICLE FAULTS WITH JEO 600H
ALL REPORTED FAULTS, DISPLAYED BY PERCENTAGE OF OCCURRENCE DURING ALL MOT TESTS
ADVISORY

FAIL

USER ENTERED

PASS WITH RECTIFICATION

JEO 600H annual Faults by type

ALL REPORTED FAULTS, DISPLAYED over time and categorised by type
JEO 600H annual Faults by type
ALL REPORTED FAULTS, DISPLAYED over time and categorised by type

RECURRING FAULTS WITH JEO 600H

FAULTS THAT HAVE OCCURED MORE THAN ONCE DURING JEO 600H's MOT HISTORY
RECURRING FAULTS WITH JEO 600H
FAULTS THAT HAVE OCCURED MORE THAN ONCE DURING JEO 600H's MOT HISTORY
Fault Fault Test Date Test Date/Time Reference MOT Test Reference
4 Offside headlamp not working on dipped beam (1.7.5a) Offside headlamp not working on dipped beam (1.7.5a) 21 November 2013 [10:02] 21/11/2013 11 November 2009 [14:38] 11/11/2009 05 October 2006 [09:56] 05/10/2006 30 September 2005 [12:01] 30/09/2005 627945623336 627945623336 681215319390 681215319390 123148476257 123148476257 453213175229 453213175229
3 Brakes imbalanced across an axle (3.7.b.5b) Brakes imbalanced across an axle (3.7.b.5b) 17 October 2017 [07:55] 17/10/2017 21 November 2013 [10:02] 21/11/2013 05 October 2006 [09:56] 05/10/2006 195097383872 195097383872 627945623336 627945623336 123148476257 123148476257
3 Offside rear suspension spring mounting prescribed area is excessively corroded (2.4.a.3) Offside rear suspension spring mounting prescribed area is excessively corroded (2.4.a.3) 16 November 2010 [16:40] 16/11/2010 11 November 2009 [14:38] 11/11/2009 05 October 2006 [09:56] 05/10/2006 223850620345 223850620345 681215319390 681215319390 123148476257 123148476257
2 Fuel cap/sealing device does not fasten securely maintaining the sealing arrangement (7.2.4b) Fuel cap/sealing device does not fasten securely maintaining the sealing arrangement (7.2.4b) 17 October 2017 [07:55] 17/10/2017 21 October 2016 [13:51] 21/10/2016 195097383872 195097383872 340253632251 340253632251
2 Parking brake: efficiency below requirements (3.7.b.7) Parking brake: efficiency below requirements (3.7.b.7) 17 October 2017 [07:55] 17/10/2017 30 September 2005 [12:01] 30/09/2005 195097383872 195097383872 453213175229 453213175229

ALL JEO 600H ADVISORIES [4]

ALL ADVISORIES, ORDERED by OCCURRENCE DURING JEO 600H's MOT HISTORY
ALL JEO 600H ADVISORIES [4]
ALL ADVISORIES, ORDERED by OCCURRENCE DURING JEO 600H's MOT HISTORY
Fail Faults | source www.vehiclestats.co.uk
Fault Fault Test Date Test Date/Time Reference MOT Test Reference
1 Vehicle structure has slight corrosion both front inner wheel arches,inner wing areas heavily corroded/holed ( non-prescribed areas) (6.1.a.1) Vehicle structure has slight corrosion both front inner wheel arches,inner wing areas heavily corroded/holed ( non-prescribed areas) (6.1.a.1) 17 October 2017 [07:55] 17/10/2017 195097383872 195097383872
1 Body has slight corrosion centre rear boot floor area corroded/ holed (6.1.b.2) Body has slight corrosion centre rear boot floor area corroded/ holed (6.1.b.2) 17 October 2017 [07:55] 17/10/2017 195097383872 195097383872
1 Offside front door hinge post corroded Offside front door hinge post corroded 17 October 2017 [07:55] 17/10/2017 195097383872 195097383872
1 Offside steering rack gaiter deteriorated (2.2.d.2d) Offside steering rack gaiter deteriorated (2.2.d.2d) 21 November 2013 [10:02] 21/11/2013 627945623336 627945623336

ALL JEO 600H Failure Faults [34]

ALL Failure faults, ORDERED by OCCURRENCE DURING JEO 600H's MOT HISTORY
ALL JEO 600H Failure Faults [34]
ALL Failure faults, ORDERED by OCCURRENCE DURING JEO 600H's MOT HISTORY
Fail Faults | source www.vehiclestats.co.uk
Fault Fault Test Date Test Date/Time Reference MOT Test Reference
3 Brakes imbalanced across an axle (3.7.b.5b) Brakes imbalanced across an axle (3.7.b.5b) 17 October 2017 [07:55] 17/10/2017 21 November 2013 [10:02] 21/11/2013 05 October 2006 [09:56] 05/10/2006 195097383872 195097383872 627945623336 627945623336 123148476257 123148476257
3 Offside headlamp not working on dipped beam (1.7.5a) Offside headlamp not working on dipped beam (1.7.5a) 21 November 2013 [10:02] 21/11/2013 11 November 2009 [14:38] 11/11/2009 05 October 2006 [09:56] 05/10/2006 627945623336 627945623336 681215319390 681215319390 123148476257 123148476257
3 Offside rear suspension spring mounting prescribed area is excessively corroded (2.4.a.3) Offside rear suspension spring mounting prescribed area is excessively corroded (2.4.a.3) 16 November 2010 [16:40] 16/11/2010 11 November 2009 [14:38] 11/11/2009 05 October 2006 [09:56] 05/10/2006 223850620345 223850620345 681215319390 681215319390 123148476257 123148476257
2 Parking brake: efficiency below requirements (3.7.b.7) Parking brake: efficiency below requirements (3.7.b.7) 17 October 2017 [07:55] 17/10/2017 30 September 2005 [12:01] 30/09/2005 195097383872 195097383872 453213175229 453213175229
1 Central exhaust system not adequately supported (7.1.1) Central exhaust system not adequately supported (7.1.1) 17 October 2017 [07:55] 17/10/2017 195097383872 195097383872
1 Nearside rear brake recording little or no effort (3.7.b.5a) Nearside rear brake recording little or no effort (3.7.b.5a) 17 October 2017 [07:55] 17/10/2017 195097383872 195097383872
1 Rear rear brake application uneven (3.7.b.2) Rear rear brake application uneven (3.7.b.2) 17 October 2017 [07:55] 17/10/2017 195097383872 195097383872
1 Nearside rear parking brake recording little or no effort (3.7.b.6a) Nearside rear parking brake recording little or no effort (3.7.b.6a) 17 October 2017 [07:55] 17/10/2017 195097383872 195097383872
1 Nearside rear brake drum contaminated by oil (3.5.1h) Nearside rear brake drum contaminated by oil (3.5.1h) 17 October 2017 [07:55] 17/10/2017 195097383872 195097383872
1 Registration plate lamp not working (1.1.c.1d) Registration plate lamp not working (1.1.c.1d) 17 October 2017 [07:55] 17/10/2017 195097383872 195097383872
1 Fuel cap/sealing device does not fasten securely maintaining the sealing arrangement (7.2.4b) Fuel cap/sealing device does not fasten securely maintaining the sealing arrangement (7.2.4b) 17 October 2017 [07:55] 17/10/2017 195097383872 195097383872
1 Offside headlamp aim too high (1.8) Offside headlamp aim too high (1.8) 17 October 2017 [07:55] 17/10/2017 195097383872 195097383872
1 Offside rear suspension spring mounting prescribed area is excessively corroded chassis section at rear, of rear leaf spring (2.4.a.3) Offside rear suspension spring mounting prescribed area is excessively corroded chassis section at rear, of rear leaf spring (2.4.a.3) 17 October 2017 [07:55] 17/10/2017 195097383872 195097383872
1 Nearside rear suspension spring mounting prescribed area is excessively corroded floor/chassis section of front of leaf spring area (2.4.a.3) Nearside rear suspension spring mounting prescribed area is excessively corroded floor/chassis section of front of leaf spring area (2.4.a.3) 17 October 2017 [07:55] 17/10/2017 195097383872 195097383872
1 Offside rear suspension spring mounting prescribed area is excessively corroded floor section of front of rear leaf spring area (2.4.a.3) Offside rear suspension spring mounting prescribed area is excessively corroded floor section of front of rear leaf spring area (2.4.a.3) 17 October 2017 [07:55] 17/10/2017 195097383872 195097383872
1 Nearside steering rack gaiter split (2.2.d.2d) Nearside steering rack gaiter split (2.2.d.2d) 17 October 2017 [07:55] 17/10/2017 195097383872 195097383872
1 Rear brakes imbalanced across an axle axle 2 (3.7.b.5b) Rear brakes imbalanced across an axle axle 2 (3.7.b.5b) 17 October 2017 [07:55] 17/10/2017 195097383872 195097383872
1 Offside windscreen washer provides insufficient washer liquid (8.2.3) Offside windscreen washer provides insufficient washer liquid (8.2.3) 21 November 2013 [10:02] 21/11/2013 627945623336 627945623336
1 Fuel cap/sealing device does not fasten securely by positive means (7.2.4b) Fuel cap/sealing device does not fasten securely by positive means (7.2.4b) 21 November 2013 [10:02] 21/11/2013 627945623336 627945623336
1 Nearside front suspension component mounting prescribed area is excessively corroded (2.4.a.3) Nearside front suspension component mounting prescribed area is excessively corroded (2.4.a.3) 16 November 2010 [16:40] 16/11/2010 223850620345 223850620345
1 Registration plate lamp not working (1.1.5c) Registration plate lamp not working (1.1.5c) 11 November 2009 [14:38] 11/11/2009 681215319390 681215319390
1 Nearside front mechanical brake component has restricted free movement (3.5.1k) Nearside front mechanical brake component has restricted free movement (3.5.1k) 11 November 2009 [14:38] 11/11/2009 681215319390 681215319390
1 Nearside headlamp not working on dipped beam (1.7.5a) Nearside headlamp not working on dipped beam (1.7.5a) 05 October 2006 [09:56] 05/10/2006 123148476257 123148476257
1 Offside headlamp not working on main beam (1.7.5a) Offside headlamp not working on main beam (1.7.5a) 05 October 2006 [09:56] 05/10/2006 123148476257 123148476257
1 Nearside rear suspension spring mounting prescribed area is excessively corroded (2.4.a.3) Nearside rear suspension spring mounting prescribed area is excessively corroded (2.4.a.3) 05 October 2006 [09:56] 05/10/2006 123148476257 123148476257
1 Offside front suspension arm has excessive play in a pin/bush (2.4.g.2) Offside front suspension arm has excessive play in a pin/bush (2.4.g.2) 05 October 2006 [09:56] 05/10/2006 123148476257 123148476257
1 Offside front front brake recording little or no effort (3.7.b.5a) Offside front front brake recording little or no effort (3.7.b.5a) 05 October 2006 [09:56] 05/10/2006 123148476257 123148476257

ALL JEO 600H User Entered Faults [1]

ALL User Entered faults, ORDERED by OCCURRENCE DURING JEO 600H's MOT HISTORY
ALL JEO 600H User Entered Faults [1]
ALL User Entered faults, ORDERED by OCCURRENCE DURING JEO 600H's MOT HISTORY
Pass With Rectification Faults | source www.vehiclestats.co.uk
Fault Fault Test Date Test Date/Time Reference MOT Test Reference
1 Footbrake pedal travel near to limit Footbrake pedal travel near to limit 30 September 2005 [12:01] 30/09/2005 453213175229 453213175229

ALL JEO 600H Pass With Rectification Faults [2]

ALL Pass With Rectification faults, ORDERED by OCCURRENCE DURING JEO 600H's MOT HISTORY
ALL JEO 600H Pass With Rectification Faults [2]
ALL Pass With Rectification faults, ORDERED by OCCURRENCE DURING JEO 600H's MOT HISTORY
Pass With Rectification Faults | source www.vehiclestats.co.uk
Fault Fault Test Date Test Date/Time Reference MOT Test Reference
1 Fuel cap/sealing device does not fasten securely maintaining the sealing arrangement (7.2.4b) Fuel cap/sealing device does not fasten securely maintaining the sealing arrangement (7.2.4b) 21 October 2016 [13:51] 21/10/2016 340253632251 340253632251
1 Offside headlamp not working on dipped beam (1.7.5a) Offside headlamp not working on dipped beam (1.7.5a) 30 September 2005 [12:01] 30/09/2005 453213175229 453213175229

MOT TEST: 17 October 2017 07:55:13 FAILED
MOT TEST: 17 October 2017 07:55:13 FAILED

This test (195097383872) was completed on the 17 October 2017 07:55:13 and FAILED the requirements for a valid MOT with 18 comments.

This test (195097383872) was completed on the 17 October 2017 07:55:13 and FAILED the requirements for a valid MOT with 18 comments.

Recorded mileage: 42,217

Recorded mileage: 42,217


ADVISORY

FAIL


MOT TEST: 21 October 2016 13:51:15 PASSED
MOT TEST: 21 October 2016 13:51:15 PASSED

This test (429733133366) was completed on the 21 October 2016 13:51:15 and PASSED the requirements for a valid MOT with 0 comments.

This test (429733133366) was completed on the 21 October 2016 13:51:15 and PASSED the requirements for a valid MOT with 0 comments.

Recorded mileage: 41,406

Recorded mileage: 41,406


MOT TEST: 21 October 2016 13:51:14 FAILED
MOT TEST: 21 October 2016 13:51:14 FAILED

This test (340253632251) was completed on the 21 October 2016 13:51:14 and FAILED the requirements for a valid MOT with 1 comments.

This test (340253632251) was completed on the 21 October 2016 13:51:14 and FAILED the requirements for a valid MOT with 1 comments.

Recorded mileage: 41,406

Recorded mileage: 41,406


PASS WITH RECTIFICATION


MOT TEST: 08 December 2014 13:50:21 PASSED
MOT TEST: 08 December 2014 13:50:21 PASSED

This test (437232744305) was completed on the 08 December 2014 13:50:21 and PASSED the requirements for a valid MOT with 0 comments.

This test (437232744305) was completed on the 08 December 2014 13:50:21 and PASSED the requirements for a valid MOT with 0 comments.

Recorded mileage: 39,785

Recorded mileage: 39,785


MOT TEST: 03 December 2013 06:58:49 PASSED
MOT TEST: 03 December 2013 06:58:49 PASSED

This test (587247133354) was completed on the 03 December 2013 06:58:49 and PASSED the requirements for a valid MOT with 0 comments.

This test (587247133354) was completed on the 03 December 2013 06:58:49 and PASSED the requirements for a valid MOT with 0 comments.

Recorded mileage: 39,215

Recorded mileage: 39,215


MOT TEST: 21 November 2013 10:02:53 FAILED
MOT TEST: 21 November 2013 10:02:53 FAILED

This test (627945623336) was completed on the 21 November 2013 10:02:53 and FAILED the requirements for a valid MOT with 5 comments.

This test (627945623336) was completed on the 21 November 2013 10:02:53 and FAILED the requirements for a valid MOT with 5 comments.

Recorded mileage: 39,214

Recorded mileage: 39,214


ADVISORY

FAIL


MOT TEST: 13 November 2012 14:53:59 PASSED
MOT TEST: 13 November 2012 14:53:59 PASSED

This test (608008712361) was completed on the 13 November 2012 14:53:59 and PASSED the requirements for a valid MOT with 0 comments.

This test (608008712361) was completed on the 13 November 2012 14:53:59 and PASSED the requirements for a valid MOT with 0 comments.

Recorded mileage: 38,748

Recorded mileage: 38,748


MOT TEST: 24 October 2011 12:58:04 PASSED
MOT TEST: 24 October 2011 12:58:04 PASSED

This test (975277291223) was completed on the 24 October 2011 12:58:04 and PASSED the requirements for a valid MOT with 0 comments.

This test (975277291223) was completed on the 24 October 2011 12:58:04 and PASSED the requirements for a valid MOT with 0 comments.

Recorded mileage: 38,367

Recorded mileage: 38,367


MOT TEST: 18 November 2010 14:53:19 PASSED
MOT TEST: 18 November 2010 14:53:19 PASSED

This test (724412820334) was completed on the 18 November 2010 14:53:19 and PASSED the requirements for a valid MOT with 0 comments.

This test (724412820334) was completed on the 18 November 2010 14:53:19 and PASSED the requirements for a valid MOT with 0 comments.

Recorded mileage: 38,146

Recorded mileage: 38,146


MOT TEST: 16 November 2010 16:40:16 FAILED
MOT TEST: 16 November 2010 16:40:16 FAILED

This test (223850620345) was completed on the 16 November 2010 16:40:16 and FAILED the requirements for a valid MOT with 2 comments.

This test (223850620345) was completed on the 16 November 2010 16:40:16 and FAILED the requirements for a valid MOT with 2 comments.

Recorded mileage: 38,146

Recorded mileage: 38,146


FAIL


MOT TEST: 20 November 2009 11:53:31 PASSED
MOT TEST: 20 November 2009 11:53:31 PASSED

This test (930764929331) was completed on the 20 November 2009 11:53:31 and PASSED the requirements for a valid MOT with 0 comments.

This test (930764929331) was completed on the 20 November 2009 11:53:31 and PASSED the requirements for a valid MOT with 0 comments.

Recorded mileage: 37,719

Recorded mileage: 37,719


MOT TEST: 11 November 2009 14:38:04 FAILED
MOT TEST: 11 November 2009 14:38:04 FAILED

This test (681215319390) was completed on the 11 November 2009 14:38:04 and FAILED the requirements for a valid MOT with 4 comments.

This test (681215319390) was completed on the 11 November 2009 14:38:04 and FAILED the requirements for a valid MOT with 4 comments.

Recorded mileage: 37,716

Recorded mileage: 37,716


FAIL


MOT TEST: 13 February 2009 07:26:49 PASSED
MOT TEST: 13 February 2009 07:26:49 PASSED

This test (101714949419) was completed on the 13 February 2009 07:26:49 and PASSED the requirements for a valid MOT with 0 comments.

This test (101714949419) was completed on the 13 February 2009 07:26:49 and PASSED the requirements for a valid MOT with 0 comments.

Recorded mileage: 37,311

Recorded mileage: 37,311


MOT TEST: 13 November 2007 12:06:32 PASSED
MOT TEST: 13 November 2007 12:06:32 PASSED

This test (744737617332) was completed on the 13 November 2007 12:06:32 and PASSED the requirements for a valid MOT with 0 comments.

This test (744737617332) was completed on the 13 November 2007 12:06:32 and PASSED the requirements for a valid MOT with 0 comments.

Recorded mileage: 36,811

Recorded mileage: 36,811


MOT TEST: 16 January 2007 14:12:51 PASSED
MOT TEST: 16 January 2007 14:12:51 PASSED

This test (182246317019) was completed on the 16 January 2007 14:12:51 and PASSED the requirements for a valid MOT with 0 comments.

This test (182246317019) was completed on the 16 January 2007 14:12:51 and PASSED the requirements for a valid MOT with 0 comments.

Recorded mileage: 36,390

Recorded mileage: 36,390


MOT TEST: 05 October 2006 09:56:45 FAILED
MOT TEST: 05 October 2006 09:56:45 FAILED

This test (123148476257) was completed on the 05 October 2006 09:56:45 and FAILED the requirements for a valid MOT with 8 comments.

This test (123148476257) was completed on the 05 October 2006 09:56:45 and FAILED the requirements for a valid MOT with 8 comments.

Recorded mileage: 36,382

Recorded mileage: 36,382


FAIL


MOT TEST: 06 October 2005 16:12:33 PASSED
MOT TEST: 06 October 2005 16:12:33 PASSED

This test (731129775200) was completed on the 06 October 2005 16:12:33 and PASSED the requirements for a valid MOT with 0 comments.

This test (731129775200) was completed on the 06 October 2005 16:12:33 and PASSED the requirements for a valid MOT with 0 comments.

Recorded mileage: 35,784

Recorded mileage: 35,784


MOT TEST: 30 September 2005 12:01:45 FAILED
MOT TEST: 30 September 2005 12:01:45 FAILED

This test (453213175229) was completed on the 30 September 2005 12:01:45 and FAILED the requirements for a valid MOT with 3 comments.

This test (453213175229) was completed on the 30 September 2005 12:01:45 and FAILED the requirements for a valid MOT with 3 comments.

Recorded mileage: 35,784

Recorded mileage: 35,784


FAIL

USER ENTERED

PASS WITH RECTIFICATION