JER 470F


JER470F is registered to a White 1968, Morris Minor 1000 with a Petrol engine. It Failed its most recent MOT Test on the 20 December 2017

51 unique faults (59 Total) reported in its MOT History (19 Tests).

8 common/recurring faults, the most frequent (2 times) is: milometer not working.

58% (11) MOT Pass Rate and a 42% (8) MOT Failure Rate.

59,702 recorded miles.

JER 470F


JER470F is registered to a White 1968, Morris Minor 1000 with a Petrol engine. It Failed its most recent MOT Test on the 20 December 2017

51 unique faults (59 Total) reported in its MOT History (19 Tests).

8 common/recurring faults, the most frequent (2 times) is: milometer not working.

58% (11) MOT Pass Rate and a 42% (8) MOT Failure Rate.

59,702 recorded miles.

MOT PASS/Failure rate for JER 470F

all MOT test results for JER 470F represented as a percentage
MOT PASS/Failure rate for JER 470F
all MOT test results for JER 470F represented as a percentage

PERCENTAGE OF VEHICLE FAULTS WITH JER 470F

ALL REPORTED FAULTS, DISPLAYED BY PERCENTAGE OF OCCURRENCE DURING ALL MOT TESTS
PERCENTAGE OF VEHICLE FAULTS WITH JER 470F
ALL REPORTED FAULTS, DISPLAYED BY PERCENTAGE OF OCCURRENCE DURING ALL MOT TESTS
ADVISORY

FAIL

USER ENTERED

JER 470F annual Faults by type

ALL REPORTED FAULTS, DISPLAYED over time and categorised by type
JER 470F annual Faults by type
ALL REPORTED FAULTS, DISPLAYED over time and categorised by type

RECURRING FAULTS WITH JER 470F

FAULTS THAT HAVE OCCURED MORE THAN ONCE DURING JER 470F's MOT HISTORY
RECURRING FAULTS WITH JER 470F
FAULTS THAT HAVE OCCURED MORE THAN ONCE DURING JER 470F's MOT HISTORY
Fault Fault Test Date Test Date/Time Reference MOT Test Reference
2 Milometer not working Milometer not working 20 December 2017 [12:14] 20/12/2017 11 May 2017 [09:22] 11/05/2017 196455212072 196455212072 951437176881 951437176881
2 Offside rear suspension spring mounting prescribed area is excessively corroded (2.4.a.3) Offside rear suspension spring mounting prescribed area is excessively corroded (2.4.a.3) 11 May 2017 [09:22] 11/05/2017 18 September 2008 [09:30] 18/09/2008 951437176881 951437176881 951042068287 951042068287
2 Parking brake: efficiency below requirements (3.7.b.7) Parking brake: efficiency below requirements (3.7.b.7) 27 September 2010 [13:12] 27/09/2010 29 June 2006 [15:21] 29/06/2006 772350570253 772350570253 761010686113 761010686113
2 Nearside rear suspension spring mounting prescribed area is excessively corroded (2.4.a.3) Nearside rear suspension spring mounting prescribed area is excessively corroded (2.4.a.3) 23 September 2009 [10:47] 23/09/2009 18 September 2008 [09:30] 18/09/2008 301496369412 301496369412 951042068287 951042068287
2 Offside front front wheel bearing has slight play (2.5.a.3c) Offside front front wheel bearing has slight play (2.5.a.3c) 25 September 2008 [16:34] 25/09/2008 18 September 2008 [09:30] 18/09/2008 233729768254 233729768254 951042068287 951042068287
2 Offside rear tyre worn close to the legal limit (4.1.e.1) Offside rear tyre worn close to the legal limit (4.1.e.1) 25 September 2008 [16:34] 25/09/2008 18 September 2008 [09:30] 18/09/2008 233729768254 233729768254 951042068287 951042068287
2 Nearside front bumpstop missing Nearside front bumpstop missing 25 September 2008 [16:34] 25/09/2008 18 September 2008 [09:30] 18/09/2008 233729768254 233729768254 951042068287 951042068287
2 Nearside rear wing insecure due to corrosion Nearside rear wing insecure due to corrosion 25 September 2008 [16:34] 25/09/2008 18 September 2008 [09:30] 18/09/2008 233729768254 233729768254 951042068287 951042068287

ALL JER 470F ADVISORIES [17]

ALL ADVISORIES, ORDERED by OCCURRENCE DURING JER 470F's MOT HISTORY
ALL JER 470F ADVISORIES [17]
ALL ADVISORIES, ORDERED by OCCURRENCE DURING JER 470F's MOT HISTORY
Advisory Faults | source www.vehiclestats.co.uk
Fault Fault Test Date Test Date/Time Reference MOT Test Reference
2 Milometer not working Milometer not working 20 December 2017 [12:14] 20/12/2017 11 May 2017 [09:22] 11/05/2017 196455212072 196455212072 951437176881 951437176881
2 Offside front front wheel bearing has slight play (2.5.a.3c) Offside front front wheel bearing has slight play (2.5.a.3c) 25 September 2008 [16:34] 25/09/2008 18 September 2008 [09:30] 18/09/2008 233729768254 233729768254 951042068287 951042068287
2 Offside rear tyre worn close to the legal limit (4.1.e.1) Offside rear tyre worn close to the legal limit (4.1.e.1) 25 September 2008 [16:34] 25/09/2008 18 September 2008 [09:30] 18/09/2008 233729768254 233729768254 951042068287 951042068287
1 Oil leak () Oil leak () 11 May 2017 [09:22] 11/05/2017 951437176881 951437176881
1 Fuel pipe/s corroded () Fuel pipe/s corroded () 11 May 2017 [09:22] 11/05/2017 951437176881 951437176881
1 Slight play in o/s/f upper truion Slight play in o/s/f upper truion 11 May 2017 [09:22] 11/05/2017 951437176881 951437176881
1 General underbody corrsion General underbody corrsion 11 May 2017 [09:22] 11/05/2017 951437176881 951437176881
1 Front tie bar/rod rubber bush deteriorated but not resulting in excessive movement (2.4.g.2) Front tie bar/rod rubber bush deteriorated but not resulting in excessive movement (2.4.g.2) 27 May 2015 [14:41] 27/05/2015 276577345141 276577345141
1 Nearside front torque/reaction arm has slight play in a ball joint (2.4.g.2) Nearside front torque/reaction arm has slight play in a ball joint (2.4.g.2) 27 May 2015 [14:41] 27/05/2015 276577345141 276577345141
1 Nearside front upper torque/reaction arm has slight play in a pin/bush (2.4.g.2) Nearside front upper torque/reaction arm has slight play in a pin/bush (2.4.g.2) 16 May 2014 [12:34] 16/05/2014 768926834106 768926834106
1 Nearside front tie bar/rod rubber bush deteriorated but not resulting in excessive movement (2.4.g.2) Nearside front tie bar/rod rubber bush deteriorated but not resulting in excessive movement (2.4.g.2) 16 May 2014 [12:34] 16/05/2014 768926834106 768926834106
1 Offside front tie bar/rod rubber bush deteriorated but not resulting in excessive movement (2.4.g.2) Offside front tie bar/rod rubber bush deteriorated but not resulting in excessive movement (2.4.g.2) 16 May 2014 [12:34] 16/05/2014 768926834106 768926834106
1 Nearside rear leaf spring has a slightly deteriorated shackle pin rubber bush not resulting in excessive movement (2.4.b.2) Nearside rear leaf spring has a slightly deteriorated shackle pin rubber bush not resulting in excessive movement (2.4.b.2) 15 May 2013 [09:48] 15/05/2013 406195933189 406195933189
1 Offside rear leaf spring has a slightly deteriorated shackle pin rubber bush not resulting in excessive movement (2.4.b.2) Offside rear leaf spring has a slightly deteriorated shackle pin rubber bush not resulting in excessive movement (2.4.b.2) 15 May 2013 [09:48] 15/05/2013 406195933189 406195933189

ALL JER 470F Failure Faults [36]

ALL Failure faults, ORDERED by OCCURRENCE DURING JER 470F's MOT HISTORY
ALL JER 470F Failure Faults [36]
ALL Failure faults, ORDERED by OCCURRENCE DURING JER 470F's MOT HISTORY
Fail Faults | source www.vehiclestats.co.uk
Fault Fault Test Date Test Date/Time Reference MOT Test Reference
2 Offside rear suspension spring mounting prescribed area is excessively corroded (2.4.a.3) Offside rear suspension spring mounting prescribed area is excessively corroded (2.4.a.3) 11 May 2017 [09:22] 11/05/2017 18 September 2008 [09:30] 18/09/2008 951437176881 951437176881 951042068287 951042068287
2 Parking brake: efficiency below requirements (3.7.b.7) Parking brake: efficiency below requirements (3.7.b.7) 27 September 2010 [13:12] 27/09/2010 29 June 2006 [15:21] 29/06/2006 772350570253 772350570253 761010686113 761010686113
2 Nearside rear suspension spring mounting prescribed area is excessively corroded (2.4.a.3) Nearside rear suspension spring mounting prescribed area is excessively corroded (2.4.a.3) 23 September 2009 [10:47] 23/09/2009 18 September 2008 [09:30] 18/09/2008 301496369412 301496369412 951042068287 951042068287
1 Nearside front wheel bearing rough when rotated (2.5.a.2) Nearside front wheel bearing rough when rotated (2.5.a.2) 11 May 2017 [09:22] 11/05/2017 951437176881 951437176881
1 Offside front wheel bearing has excessive play (2.5.a.3c) Offside front wheel bearing has excessive play (2.5.a.3c) 11 May 2017 [09:22] 11/05/2017 951437176881 951437176881
1 Offside suspension component mounting prescribed area is excessively corroded front floor (2.4.a.3) Offside suspension component mounting prescribed area is excessively corroded front floor (2.4.a.3) 11 May 2017 [09:22] 11/05/2017 951437176881 951437176881
1 Rear brakes imbalanced across an axle axle 2 (3.7.b.5b) Rear brakes imbalanced across an axle axle 2 (3.7.b.5b) 11 May 2017 [09:22] 11/05/2017 951437176881 951437176881
1 Nearside stop lamp not working (1.2.1b) Nearside stop lamp not working (1.2.1b) 15 May 2013 [09:48] 15/05/2013 406195933189 406195933189
1 Offside stop lamp not working (1.2.1b) Offside stop lamp not working (1.2.1b) 15 May 2013 [09:48] 15/05/2013 406195933189 406195933189
1 Direction indicators not working (1.4.a.2c) Direction indicators not working (1.4.a.2c) 15 May 2013 [09:48] 15/05/2013 406195933189 406195933189
1 Hazard warning lamps inoperative (1.4.b.1b) Hazard warning lamps inoperative (1.4.b.1b) 15 May 2013 [09:48] 15/05/2013 406195933189 406195933189
1 Horn not working (1.6.2a) Horn not working (1.6.2a) 15 May 2013 [09:48] 15/05/2013 406195933189 406195933189
1 Nearside front headlamp not working on main beam (1.7.5a) Nearside front headlamp not working on main beam (1.7.5a) 27 September 2010 [13:12] 27/09/2010 772350570253 772350570253
1 Offside front headlamp not working on main beam (1.7.5a) Offside front headlamp not working on main beam (1.7.5a) 27 September 2010 [13:12] 27/09/2010 772350570253 772350570253
1 Windscreen washer provides insufficient washer liquid (8.2.3) Windscreen washer provides insufficient washer liquid (8.2.3) 27 September 2010 [13:12] 27/09/2010 772350570253 772350570253
1 Nearside front suspension component mounting prescribed area is excessively corroded (2.4.a.3) Nearside front suspension component mounting prescribed area is excessively corroded (2.4.a.3) 27 September 2010 [13:12] 27/09/2010 772350570253 772350570253
1 Offside front suspension component mounting prescribed area is excessively corroded (2.4.a.3) Offside front suspension component mounting prescribed area is excessively corroded (2.4.a.3) 27 September 2010 [13:12] 27/09/2010 772350570253 772350570253
1 Fuel cap/sealing device sealing washer missing (7.2.4c) Fuel cap/sealing device sealing washer missing (7.2.4c) 18 September 2008 [09:30] 18/09/2008 951042068287 951042068287
1 Nearside rear rear position lamp(s) adversely affected by the operation of another lamp (1.1.a.3f) Nearside rear rear position lamp(s) adversely affected by the operation of another lamp (1.1.a.3f) 18 September 2007 [10:10] 18/09/2007 621131467216 621131467216
1 Nearside rear stop lamp adversely affected by the operation of another lamp (1.2.1f) Nearside rear stop lamp adversely affected by the operation of another lamp (1.2.1f) 18 September 2007 [10:10] 18/09/2007 621131467216 621131467216
1 Nearside rear direction indicator adversely affected by the operation of another lamp (1.4.a.2h) Nearside rear direction indicator adversely affected by the operation of another lamp (1.4.a.2h) 18 September 2007 [10:10] 18/09/2007 621131467216 621131467216
1 Nearside indicator tell tale inoperative (1.4.a.2a) Nearside indicator tell tale inoperative (1.4.a.2a) 18 September 2007 [10:10] 18/09/2007 621131467216 621131467216
1 Nearside front steering locking device missing (2.2.c.1g) Nearside front steering locking device missing (2.2.c.1g) 18 September 2007 [10:10] 18/09/2007 621131467216 621131467216
1 Offside front steering locking device missing (2.2.c.1g) Offside front steering locking device missing (2.2.c.1g) 18 September 2007 [10:10] 18/09/2007 621131467216 621131467216
1 Offside front lower seat belt anchorage prescribed area is excessively corroded (5.2.6) Offside front lower seat belt anchorage prescribed area is excessively corroded (5.2.6) 19 September 2006 [14:19] 19/09/2006 611172266208 611172266208
1 Front front brake application uneven (3.7.b.2) Front front brake application uneven (3.7.b.2) 19 September 2006 [14:19] 19/09/2006 611172266208 611172266208
1 Brakes imbalanced across an axle (3.7.b.5b) Brakes imbalanced across an axle (3.7.b.5b) 19 September 2006 [14:19] 19/09/2006 611172266208 611172266208
1 Offside front steering arm has relative movement at its fixings (2.2.b.1h) Offside front steering arm has relative movement at its fixings (2.2.b.1h) 29 June 2006 [15:21] 29/06/2006 761010686113 761010686113
1 Nearside front steering arm has relative movement at its fixings (2.2.b.1h) Nearside front steering arm has relative movement at its fixings (2.2.b.1h) 29 June 2006 [15:21] 29/06/2006 761010686113 761010686113
1 Nearside rear body or chassis has excessive corrosion, seriously affecting its strength within 30cm of the body mountings (6.1.b.2) Nearside rear body or chassis has excessive corrosion, seriously affecting its strength within 30cm of the body mountings (6.1.b.2) 29 June 2006 [15:21] 29/06/2006 761010686113 761010686113
1 Offside rear body or chassis has excessive corrosion, seriously affecting its strength within 30cm of the body mountings (6.1.b.2) Offside rear body or chassis has excessive corrosion, seriously affecting its strength within 30cm of the body mountings (6.1.b.2) 29 June 2006 [15:21] 29/06/2006 761010686113 761010686113
1 Brake performance not tested (3.7.a.1) Brake performance not tested (3.7.a.1) 29 June 2006 [15:21] 29/06/2006 761010686113 761010686113
1 Service brake: efficiency below requirements (3.7.b.7) Service brake: efficiency below requirements (3.7.b.7) 29 June 2006 [15:21] 29/06/2006 761010686113 761010686113

ALL JER 470F User Entered Faults [6]

ALL User Entered faults, ORDERED by OCCURRENCE DURING JER 470F's MOT HISTORY
ALL JER 470F User Entered Faults [6]
ALL User Entered faults, ORDERED by OCCURRENCE DURING JER 470F's MOT HISTORY
Advisory Faults | source www.vehiclestats.co.uk
Fault Fault Test Date Test Date/Time Reference MOT Test Reference
2 Nearside front bumpstop missing Nearside front bumpstop missing 25 September 2008 [16:34] 25/09/2008 18 September 2008 [09:30] 18/09/2008 233729768254 233729768254 951042068287 951042068287
2 Nearside rear wing insecure due to corrosion Nearside rear wing insecure due to corrosion 25 September 2008 [16:34] 25/09/2008 18 September 2008 [09:30] 18/09/2008 233729768254 233729768254 951042068287 951042068287
1 Nearside front bump stop missing Nearside front bump stop missing 18 September 2007 [10:10] 18/09/2007 621131467216 621131467216
1 This vehicle has excessive corrosion throughout which i feel is very detremental to its safe use. This vehicle has excessive corrosion throughout which i feel is very detremental to its safe use. 29 June 2006 [15:21] 29/06/2006 761010686113 761010686113

MOT TEST: 20 December 2017 12:14:56 PASSED
MOT TEST: 20 December 2017 12:14:56 PASSED

This test (196455212072) was completed on the 20 December 2017 12:14:56 and PASSED the requirements for a valid MOT with 1 comments.

This test (196455212072) was completed on the 20 December 2017 12:14:56 and PASSED the requirements for a valid MOT with 1 comments.

Recorded mileage: 59,699

Recorded mileage: 59,699


ADVISORY


MOT TEST: 11 May 2017 09:22:32 FAILED
MOT TEST: 11 May 2017 09:22:32 FAILED

This test (951437176881) was completed on the 11 May 2017 09:22:32 and FAILED the requirements for a valid MOT with 10 comments.

This test (951437176881) was completed on the 11 May 2017 09:22:32 and FAILED the requirements for a valid MOT with 10 comments.

Recorded mileage: 59,699

Recorded mileage: 59,699


ADVISORY

FAIL


MOT TEST: 16 May 2016 15:06:04 PASSED
MOT TEST: 16 May 2016 15:06:04 PASSED

This test (206866128539) was completed on the 16 May 2016 15:06:04 and PASSED the requirements for a valid MOT with 0 comments.

This test (206866128539) was completed on the 16 May 2016 15:06:04 and PASSED the requirements for a valid MOT with 0 comments.

Recorded mileage: 59,699

Recorded mileage: 59,699


MOT TEST: 27 May 2015 14:41:20 PASSED
MOT TEST: 27 May 2015 14:41:20 PASSED

This test (276577345141) was completed on the 27 May 2015 14:41:20 and PASSED the requirements for a valid MOT with 2 comments.

This test (276577345141) was completed on the 27 May 2015 14:41:20 and PASSED the requirements for a valid MOT with 2 comments.

Recorded mileage: 59,699

Recorded mileage: 59,699


ADVISORY


MOT TEST: 16 May 2014 12:34:49 PASSED
MOT TEST: 16 May 2014 12:34:49 PASSED

This test (768926834106) was completed on the 16 May 2014 12:34:49 and PASSED the requirements for a valid MOT with 3 comments.

This test (768926834106) was completed on the 16 May 2014 12:34:49 and PASSED the requirements for a valid MOT with 3 comments.

Recorded mileage: 59,699

Recorded mileage: 59,699


ADVISORY


MOT TEST: 21 May 2013 09:36:23 PASSED
MOT TEST: 21 May 2013 09:36:23 PASSED

This test (686701543109) was completed on the 21 May 2013 09:36:23 and PASSED the requirements for a valid MOT with 0 comments.

This test (686701543109) was completed on the 21 May 2013 09:36:23 and PASSED the requirements for a valid MOT with 0 comments.

Recorded mileage: 59,699

Recorded mileage: 59,699


MOT TEST: 15 May 2013 09:48:40 FAILED
MOT TEST: 15 May 2013 09:48:40 FAILED

This test (406195933189) was completed on the 15 May 2013 09:48:40 and FAILED the requirements for a valid MOT with 7 comments.

This test (406195933189) was completed on the 15 May 2013 09:48:40 and FAILED the requirements for a valid MOT with 7 comments.

Recorded mileage: 59,699

Recorded mileage: 59,699


ADVISORY

FAIL


MOT TEST: 17 May 2012 09:35:03 PASSED
MOT TEST: 17 May 2012 09:35:03 PASSED

This test (245388232481) was completed on the 17 May 2012 09:35:03 and PASSED the requirements for a valid MOT with 0 comments.

This test (245388232481) was completed on the 17 May 2012 09:35:03 and PASSED the requirements for a valid MOT with 0 comments.

Recorded mileage: 59,699

Recorded mileage: 59,699


MOT TEST: 13 October 2010 15:00:27 PASSED
MOT TEST: 13 October 2010 15:00:27 PASSED

This test (920766580289) was completed on the 13 October 2010 15:00:27 and PASSED the requirements for a valid MOT with 0 comments.

This test (920766580289) was completed on the 13 October 2010 15:00:27 and PASSED the requirements for a valid MOT with 0 comments.

Recorded mileage: 59,668

Recorded mileage: 59,668


MOT TEST: 27 September 2010 13:12:37 FAILED
MOT TEST: 27 September 2010 13:12:37 FAILED

This test (772350570253) was completed on the 27 September 2010 13:12:37 and FAILED the requirements for a valid MOT with 6 comments.

This test (772350570253) was completed on the 27 September 2010 13:12:37 and FAILED the requirements for a valid MOT with 6 comments.

Recorded mileage: 59,699

Recorded mileage: 59,699


FAIL


MOT TEST: 28 September 2009 08:26:55 PASSED
MOT TEST: 28 September 2009 08:26:55 PASSED

This test (383061579439) was completed on the 28 September 2009 08:26:55 and PASSED the requirements for a valid MOT with 0 comments.

This test (383061579439) was completed on the 28 September 2009 08:26:55 and PASSED the requirements for a valid MOT with 0 comments.

Recorded mileage: 59,698

Recorded mileage: 59,698


MOT TEST: 23 September 2009 10:47:41 FAILED
MOT TEST: 23 September 2009 10:47:41 FAILED

This test (301496369412) was completed on the 23 September 2009 10:47:41 and FAILED the requirements for a valid MOT with 1 comments.

This test (301496369412) was completed on the 23 September 2009 10:47:41 and FAILED the requirements for a valid MOT with 1 comments.

Recorded mileage: 59,698

Recorded mileage: 59,698


FAIL


MOT TEST: 25 September 2008 16:34:16 PASSED
MOT TEST: 25 September 2008 16:34:16 PASSED

This test (233729768254) was completed on the 25 September 2008 16:34:16 and PASSED the requirements for a valid MOT with 4 comments.

This test (233729768254) was completed on the 25 September 2008 16:34:16 and PASSED the requirements for a valid MOT with 4 comments.

Recorded mileage: 59,702

Recorded mileage: 59,702


ADVISORY

USER ENTERED


MOT TEST: 18 September 2008 09:30:31 FAILED
MOT TEST: 18 September 2008 09:30:31 FAILED

This test (951042068287) was completed on the 18 September 2008 09:30:31 and FAILED the requirements for a valid MOT with 7 comments.

This test (951042068287) was completed on the 18 September 2008 09:30:31 and FAILED the requirements for a valid MOT with 7 comments.

Recorded mileage: 59,699

Recorded mileage: 59,699


ADVISORY

FAIL

USER ENTERED


MOT TEST: 20 September 2007 16:16:03 PASSED
MOT TEST: 20 September 2007 16:16:03 PASSED

This test (411293567213) was completed on the 20 September 2007 16:16:03 and PASSED the requirements for a valid MOT with 0 comments.

This test (411293567213) was completed on the 20 September 2007 16:16:03 and PASSED the requirements for a valid MOT with 0 comments.

Recorded mileage: 5,701

Recorded mileage: 5,701


MOT TEST: 18 September 2007 10:10:11 FAILED
MOT TEST: 18 September 2007 10:10:11 FAILED

This test (621131467216) was completed on the 18 September 2007 10:10:11 and FAILED the requirements for a valid MOT with 7 comments.

This test (621131467216) was completed on the 18 September 2007 10:10:11 and FAILED the requirements for a valid MOT with 7 comments.

Recorded mileage: 59,699

Recorded mileage: 59,699


FAIL

USER ENTERED


MOT TEST: 21 September 2006 14:30:36 PASSED
MOT TEST: 21 September 2006 14:30:36 PASSED

This test (493024366252) was completed on the 21 September 2006 14:30:36 and PASSED the requirements for a valid MOT with 0 comments.

This test (493024366252) was completed on the 21 September 2006 14:30:36 and PASSED the requirements for a valid MOT with 0 comments.

Recorded mileage: 59,699

Recorded mileage: 59,699


MOT TEST: 19 September 2006 14:19:36 FAILED
MOT TEST: 19 September 2006 14:19:36 FAILED

This test (611172266208) was completed on the 19 September 2006 14:19:36 and FAILED the requirements for a valid MOT with 3 comments.

This test (611172266208) was completed on the 19 September 2006 14:19:36 and FAILED the requirements for a valid MOT with 3 comments.

Recorded mileage: 59,699

Recorded mileage: 59,699


FAIL


MOT TEST: 29 June 2006 15:21:28 FAILED
MOT TEST: 29 June 2006 15:21:28 FAILED

This test (761010686113) was completed on the 29 June 2006 15:21:28 and FAILED the requirements for a valid MOT with 8 comments.

This test (761010686113) was completed on the 29 June 2006 15:21:28 and FAILED the requirements for a valid MOT with 8 comments.

Recorded mileage: 59,699

Recorded mileage: 59,699


FAIL

USER ENTERED