JF2 437


JF2437 is registered to a Black 1931, Morris Minor with a Petrol engine. It Failed its most recent MOT Test on the 10 November 2011

9 unique faults (9 Total) reported in its MOT History (7 Tests).

0 common/recurring faults.

86% (6) MOT Pass Rate and a 14% (1) MOT Failure Rate.

51,889 recorded miles.

JF2 437


JF2437 is registered to a Black 1931, Morris Minor with a Petrol engine. It Failed its most recent MOT Test on the 10 November 2011

9 unique faults (9 Total) reported in its MOT History (7 Tests).

0 common/recurring faults.

86% (6) MOT Pass Rate and a 14% (1) MOT Failure Rate.

51,889 recorded miles.

MOT PASS/Failure rate for JF2 437

all MOT test results for JF2 437 represented as a percentage
MOT PASS/Failure rate for JF2 437
all MOT test results for JF2 437 represented as a percentage

PERCENTAGE OF VEHICLE FAULTS WITH JF2 437

ALL REPORTED FAULTS, DISPLAYED BY PERCENTAGE OF OCCURRENCE DURING ALL MOT TESTS
PERCENTAGE OF VEHICLE FAULTS WITH JF2 437
ALL REPORTED FAULTS, DISPLAYED BY PERCENTAGE OF OCCURRENCE DURING ALL MOT TESTS
ADVISORY

FAIL

JF2 437 annual Faults by type

ALL REPORTED FAULTS, DISPLAYED over time and categorised by type
JF2 437 annual Faults by type
ALL REPORTED FAULTS, DISPLAYED over time and categorised by type

ALL JF2 437 ADVISORIES [5]

ALL ADVISORIES, ORDERED by OCCURRENCE DURING JF2 437's MOT HISTORY
ALL JF2 437 ADVISORIES [5]
ALL ADVISORIES, ORDERED by OCCURRENCE DURING JF2 437's MOT HISTORY
Fail Faults | source www.vehiclestats.co.uk
Fault Fault Test Date Test Date/Time Reference MOT Test Reference
1 Nearside front road wheel spoke slightly loose (4.2.a.1b) Nearside front road wheel spoke slightly loose (4.2.a.1b) 19 October 2011 [17:10] 19/10/2011 198912791256 198912791256
1 Nearside axle king pin has slight play in pin and/or bush (2.5.a.3a) Nearside axle king pin has slight play in pin and/or bush (2.5.a.3a) 19 October 2010 [16:25] 19/10/2010 893752890254 893752890254
1 Offside axle king pin has slight play in pin and/or bush (2.5.a.3a) Offside axle king pin has slight play in pin and/or bush (2.5.a.3a) 19 October 2010 [16:25] 19/10/2010 893752890254 893752890254
1 Nearside front axle king pin has slight play in pin and/or bush (2.5.a.3a) Nearside front axle king pin has slight play in pin and/or bush (2.5.a.3a) 19 October 2009 [16:39] 19/10/2009 493742699245 493742699245
1 Offside front axle king pin has slight play in pin and/or bush (2.5.a.3a) Offside front axle king pin has slight play in pin and/or bush (2.5.a.3a) 19 October 2009 [16:39] 19/10/2009 493742699245 493742699245

ALL JF2 437 Failure Faults [4]

ALL Failure faults, ORDERED by OCCURRENCE DURING JF2 437's MOT HISTORY
ALL JF2 437 Failure Faults [4]
ALL Failure faults, ORDERED by OCCURRENCE DURING JF2 437's MOT HISTORY
Fail Faults | source www.vehiclestats.co.uk
Fault Fault Test Date Test Date/Time Reference MOT Test Reference
1 Nearside semaphore indicator arm arm does not show an amber light to the front (1.4.c.1b) Nearside semaphore indicator arm arm does not show an amber light to the front (1.4.c.1b) 19 October 2011 [17:10] 19/10/2011 198912791256 198912791256
1 Nearside front front brake recording little or no effort (3.7.b.5a) Nearside front front brake recording little or no effort (3.7.b.5a) 19 October 2011 [17:10] 19/10/2011 198912791256 198912791256
1 Offside front front brake recording little or no effort (3.7.b.5a) Offside front front brake recording little or no effort (3.7.b.5a) 19 October 2011 [17:10] 19/10/2011 198912791256 198912791256
1 Service brake: efficiency below requirements (3.7.b.7) Service brake: efficiency below requirements (3.7.b.7) 19 October 2011 [17:10] 19/10/2011 198912791256 198912791256

MOT TEST: 10 November 2011 17:09:16 PASSED
MOT TEST: 10 November 2011 17:09:16 PASSED

This test (969804411316) was completed on the 10 November 2011 17:09:16 and PASSED the requirements for a valid MOT with 0 comments.

This test (969804411316) was completed on the 10 November 2011 17:09:16 and PASSED the requirements for a valid MOT with 0 comments.

Recorded mileage: 51,507

Recorded mileage: 51,507


MOT TEST: 19 October 2011 17:10:52 FAILED
MOT TEST: 19 October 2011 17:10:52 FAILED

This test (198912791256) was completed on the 19 October 2011 17:10:52 and FAILED the requirements for a valid MOT with 5 comments.

This test (198912791256) was completed on the 19 October 2011 17:10:52 and FAILED the requirements for a valid MOT with 5 comments.

Recorded mileage: 51,507

Recorded mileage: 51,507


ADVISORY

FAIL


MOT TEST: 19 October 2010 16:25:52 PASSED
MOT TEST: 19 October 2010 16:25:52 PASSED

This test (893752890254) was completed on the 19 October 2010 16:25:52 and PASSED the requirements for a valid MOT with 2 comments.

This test (893752890254) was completed on the 19 October 2010 16:25:52 and PASSED the requirements for a valid MOT with 2 comments.

Recorded mileage: 51,475

Recorded mileage: 51,475


ADVISORY


MOT TEST: 19 October 2009 16:39:21 PASSED
MOT TEST: 19 October 2009 16:39:21 PASSED

This test (493742699245) was completed on the 19 October 2009 16:39:21 and PASSED the requirements for a valid MOT with 2 comments.

This test (493742699245) was completed on the 19 October 2009 16:39:21 and PASSED the requirements for a valid MOT with 2 comments.

Recorded mileage: 51,282

Recorded mileage: 51,282


ADVISORY


MOT TEST: 23 September 2008 09:26:18 PASSED
MOT TEST: 23 September 2008 09:26:18 PASSED

This test (971307468298) was completed on the 23 September 2008 09:26:18 and PASSED the requirements for a valid MOT with 0 comments.

This test (971307468298) was completed on the 23 September 2008 09:26:18 and PASSED the requirements for a valid MOT with 0 comments.

Recorded mileage: 51,889

Recorded mileage: 51,889


MOT TEST: 06 September 2007 12:36:52 PASSED
MOT TEST: 06 September 2007 12:36:52 PASSED

This test (704459347209) was completed on the 06 September 2007 12:36:52 and PASSED the requirements for a valid MOT with 0 comments.

This test (704459347209) was completed on the 06 September 2007 12:36:52 and PASSED the requirements for a valid MOT with 0 comments.

Recorded mileage: 51,135

Recorded mileage: 51,135


MOT TEST: 21 September 2006 17:16:29 PASSED
MOT TEST: 21 September 2006 17:16:29 PASSED

This test (793234166243) was completed on the 21 September 2006 17:16:29 and PASSED the requirements for a valid MOT with 0 comments.

This test (793234166243) was completed on the 21 September 2006 17:16:29 and PASSED the requirements for a valid MOT with 0 comments.

Recorded mileage: 51,100

Recorded mileage: 51,100