JFB 267H


JFB267H is registered to a White 1970, Morris Minor 1000 with a Petrol engine. It Failed its most recent MOT Test on the 29 June 2017

23 unique faults (27 Total) reported in its MOT History (16 Tests).

4 common/recurring faults, the most frequent (2 times) is: corrosion both rear under arches.

75% (12) MOT Pass Rate and a 25% (4) MOT Failure Rate.

30,158 recorded miles.

JFB 267H


JFB267H is registered to a White 1970, Morris Minor 1000 with a Petrol engine. It Failed its most recent MOT Test on the 29 June 2017

23 unique faults (27 Total) reported in its MOT History (16 Tests).

4 common/recurring faults, the most frequent (2 times) is: corrosion both rear under arches.

75% (12) MOT Pass Rate and a 25% (4) MOT Failure Rate.

30,158 recorded miles.

MOT PASS/Failure rate for JFB 267H

all MOT test results for JFB 267H represented as a percentage
MOT PASS/Failure rate for JFB 267H
all MOT test results for JFB 267H represented as a percentage

PERCENTAGE OF VEHICLE FAULTS WITH JFB 267H

ALL REPORTED FAULTS, DISPLAYED BY PERCENTAGE OF OCCURRENCE DURING ALL MOT TESTS
PERCENTAGE OF VEHICLE FAULTS WITH JFB 267H
ALL REPORTED FAULTS, DISPLAYED BY PERCENTAGE OF OCCURRENCE DURING ALL MOT TESTS
ADVISORY

FAIL

USER ENTERED

JFB 267H annual Faults by type

ALL REPORTED FAULTS, DISPLAYED over time and categorised by type
JFB 267H annual Faults by type
ALL REPORTED FAULTS, DISPLAYED over time and categorised by type

RECURRING FAULTS WITH JFB 267H

FAULTS THAT HAVE OCCURED MORE THAN ONCE DURING JFB 267H's MOT HISTORY
RECURRING FAULTS WITH JFB 267H
FAULTS THAT HAVE OCCURED MORE THAN ONCE DURING JFB 267H's MOT HISTORY
Fault Fault Test Date Test Date/Time Reference MOT Test Reference
2 Corrosion both rear under arches Corrosion both rear under arches 19 August 2014 [09:31] 19/08/2014 19 August 2014 [08:32] 19/08/2014 536771134292 536771134292 319491034400 319491034400
2 Nearside front shock absorber has a slightly reduced damping effect (2.7.5) Nearside front shock absorber has a slightly reduced damping effect (2.7.5) 08 August 2006 [16:55] 08/08/2006 08 August 2006 [11:37] 08/08/2006 151230826224 151230826224 840580926280 840580926280
2 Offside front shock absorber has a slightly reduced damping effect (2.7.5) Offside front shock absorber has a slightly reduced damping effect (2.7.5) 08 August 2006 [16:55] 08/08/2006 08 August 2006 [11:37] 08/08/2006 151230826224 151230826224 840580926280 840580926280
2 Slight play in n/s front lower trunnion joint. Slight play in n/s front lower trunnion joint. 08 August 2006 [16:55] 08/08/2006 08 August 2006 [11:37] 08/08/2006 151230826224 151230826224 840580926280 840580926280

ALL JFB 267H ADVISORIES [11]

ALL ADVISORIES, ORDERED by OCCURRENCE DURING JFB 267H's MOT HISTORY
ALL JFB 267H ADVISORIES [11]
ALL ADVISORIES, ORDERED by OCCURRENCE DURING JFB 267H's MOT HISTORY
Advisory Faults | source www.vehiclestats.co.uk
Fault Fault Test Date Test Date/Time Reference MOT Test Reference
2 Nearside front shock absorber has a slightly reduced damping effect (2.7.5) Nearside front shock absorber has a slightly reduced damping effect (2.7.5) 08 August 2006 [16:55] 08/08/2006 08 August 2006 [11:37] 08/08/2006 151230826224 151230826224 840580926280 840580926280
2 Offside front shock absorber has a slightly reduced damping effect (2.7.5) Offside front shock absorber has a slightly reduced damping effect (2.7.5) 08 August 2006 [16:55] 08/08/2006 08 August 2006 [11:37] 08/08/2006 151230826224 151230826224 840580926280 840580926280
1 All tyres showing signs of perishing All tyres showing signs of perishing 13 June 2016 [07:34] 13/06/2016 597418136062 597418136062
1 Front upper suspension arm rubber bush deteriorated but not resulting in excessive movement both (2.4.g.2) Front upper suspension arm rubber bush deteriorated but not resulting in excessive movement both (2.4.g.2) 20 August 2015 [13:35] 20/08/2015 905111461178 905111461178
1 Offside front lower arch inner areas corroding Offside front lower arch inner areas corroding 20 August 2015 [13:35] 20/08/2015 905111461178 905111461178
1 Rear inner arch areas corroded Rear inner arch areas corroded 20 August 2015 [13:35] 20/08/2015 905111461178 905111461178
1 Nearside front upper suspension arm has slight play in a pin/bush (2.4.g.2) Nearside front upper suspension arm has slight play in a pin/bush (2.4.g.2) 08 August 2009 [09:56] 08/08/2009 102310629217 102310629217
1 Nearside front track rod end ball joint has slight play (2.2.b.1f) Nearside front track rod end ball joint has slight play (2.2.b.1f) 09 August 2008 [10:15] 09/08/2008 120972528202 120972528202
1 Offside front track rod end ball joint has slight play (2.2.b.1f) Offside front track rod end ball joint has slight play (2.2.b.1f) 09 August 2008 [10:15] 09/08/2008 120972528202 120972528202

ALL JFB 267H Failure Faults [12]

ALL Failure faults, ORDERED by OCCURRENCE DURING JFB 267H's MOT HISTORY
ALL JFB 267H Failure Faults [12]
ALL Failure faults, ORDERED by OCCURRENCE DURING JFB 267H's MOT HISTORY
Fail Faults | source www.vehiclestats.co.uk
Fault Fault Test Date Test Date/Time Reference MOT Test Reference
1 Nearside front tyre has ply or cords exposed (4.1.d.1b) Nearside front tyre has ply or cords exposed (4.1.d.1b) 20 June 2017 [08:58] 20/06/2017 179420407466 179420407466
1 Offside front tyre has a cut in excess of the requirements deep enough to reach the ply or cords (4.1.d.1a) Offside front tyre has a cut in excess of the requirements deep enough to reach the ply or cords (4.1.d.1a) 20 June 2017 [08:58] 20/06/2017 179420407466 179420407466
1 Nearside rear tyre has a cut in excess of the requirements deep enough to reach the ply or cords (4.1.d.1a) Nearside rear tyre has a cut in excess of the requirements deep enough to reach the ply or cords (4.1.d.1a) 20 June 2017 [08:58] 20/06/2017 179420407466 179420407466
1 Offside rear tyre has ply or cords exposed (4.1.d.1b) Offside rear tyre has ply or cords exposed (4.1.d.1b) 20 June 2017 [08:58] 20/06/2017 179420407466 179420407466
1 Nearside headlamp aim too low (1.8) Nearside headlamp aim too low (1.8) 19 August 2014 [08:32] 19/08/2014 319491034400 319491034400
1 Registration plate lamp not working (1.1.c.1d) Registration plate lamp not working (1.1.c.1d) 19 August 2014 [08:32] 19/08/2014 319491034400 319491034400
1 Nearside rear suspension spring mounting prescribed area is excessively corroded (2.4.a.3) Nearside rear suspension spring mounting prescribed area is excessively corroded (2.4.a.3) 04 August 2007 [10:05] 04/08/2007 350616117266 350616117266
1 Brake pedal has insufficient reserve movement (3.3.a.5) Brake pedal has insufficient reserve movement (3.3.a.5) 04 August 2007 [10:05] 04/08/2007 350616117266 350616117266
1 Offside front tie bar/rod rubber bush deteriorated resulting in excessive movement (2.4.g.2) Offside front tie bar/rod rubber bush deteriorated resulting in excessive movement (2.4.g.2) 04 August 2007 [10:05] 04/08/2007 350616117266 350616117266
1 Offside rear position lamp(s) insecure (1.1.a.3a) Offside rear position lamp(s) insecure (1.1.a.3a) 08 August 2006 [11:37] 08/08/2006 840580926280 840580926280
1 Offside rear direction indicator insecure (1.4.a.2b) Offside rear direction indicator insecure (1.4.a.2b) 08 August 2006 [11:37] 08/08/2006 840580926280 840580926280
1 Offside rear direction indicator incorrect colour (1.4.a.2f) Offside rear direction indicator incorrect colour (1.4.a.2f) 08 August 2006 [11:37] 08/08/2006 840580926280 840580926280

ALL JFB 267H User Entered Faults [4]

ALL User Entered faults, ORDERED by OCCURRENCE DURING JFB 267H's MOT HISTORY
ALL JFB 267H User Entered Faults [4]
ALL User Entered faults, ORDERED by OCCURRENCE DURING JFB 267H's MOT HISTORY
User Entered Faults | source www.vehiclestats.co.uk
Fault Fault Test Date Test Date/Time Reference MOT Test Reference
2 Corrosion both rear under arches Corrosion both rear under arches 19 August 2014 [09:31] 19/08/2014 19 August 2014 [08:32] 19/08/2014 536771134292 536771134292 319491034400 319491034400
2 Slight play in n/s front lower trunnion joint. Slight play in n/s front lower trunnion joint. 08 August 2006 [16:55] 08/08/2006 08 August 2006 [11:37] 08/08/2006 151230826224 151230826224 840580926280 840580926280

MOT TEST: 29 June 2017 16:13:58 PASSED
MOT TEST: 29 June 2017 16:13:58 PASSED

This test (685383071377) was completed on the 29 June 2017 16:13:58 and PASSED the requirements for a valid MOT with 0 comments.

This test (685383071377) was completed on the 29 June 2017 16:13:58 and PASSED the requirements for a valid MOT with 0 comments.

Recorded mileage: 30,158

Recorded mileage: 30,158


MOT TEST: 20 June 2017 08:58:19 FAILED
MOT TEST: 20 June 2017 08:58:19 FAILED

This test (179420407466) was completed on the 20 June 2017 08:58:19 and FAILED the requirements for a valid MOT with 4 comments.

This test (179420407466) was completed on the 20 June 2017 08:58:19 and FAILED the requirements for a valid MOT with 4 comments.

Recorded mileage: 30,156

Recorded mileage: 30,156


FAIL


MOT TEST: 13 June 2016 07:34:57 PASSED
MOT TEST: 13 June 2016 07:34:57 PASSED

This test (597418136062) was completed on the 13 June 2016 07:34:57 and PASSED the requirements for a valid MOT with 1 comments.

This test (597418136062) was completed on the 13 June 2016 07:34:57 and PASSED the requirements for a valid MOT with 1 comments.

Recorded mileage: 29,349

Recorded mileage: 29,349


ADVISORY


MOT TEST: 20 August 2015 13:35:09 PASSED
MOT TEST: 20 August 2015 13:35:09 PASSED

This test (905111461178) was completed on the 20 August 2015 13:35:09 and PASSED the requirements for a valid MOT with 3 comments.

This test (905111461178) was completed on the 20 August 2015 13:35:09 and PASSED the requirements for a valid MOT with 3 comments.

Recorded mileage: 29,028

Recorded mileage: 29,028


ADVISORY


MOT TEST: 19 August 2014 09:31:12 PASSED
MOT TEST: 19 August 2014 09:31:12 PASSED

This test (536771134292) was completed on the 19 August 2014 09:31:12 and PASSED the requirements for a valid MOT with 1 comments.

This test (536771134292) was completed on the 19 August 2014 09:31:12 and PASSED the requirements for a valid MOT with 1 comments.

Recorded mileage: 28,605

Recorded mileage: 28,605


USER ENTERED


MOT TEST: 19 August 2014 08:32:12 FAILED
MOT TEST: 19 August 2014 08:32:12 FAILED

This test (319491034400) was completed on the 19 August 2014 08:32:12 and FAILED the requirements for a valid MOT with 3 comments.

This test (319491034400) was completed on the 19 August 2014 08:32:12 and FAILED the requirements for a valid MOT with 3 comments.

Recorded mileage: 28,601

Recorded mileage: 28,601


FAIL

USER ENTERED


MOT TEST: 09 August 2013 14:50:05 PASSED
MOT TEST: 09 August 2013 14:50:05 PASSED

This test (225151023285) was completed on the 09 August 2013 14:50:05 and PASSED the requirements for a valid MOT with 0 comments.

This test (225151023285) was completed on the 09 August 2013 14:50:05 and PASSED the requirements for a valid MOT with 0 comments.

Recorded mileage: 28,041

Recorded mileage: 28,041


MOT TEST: 14 August 2012 10:14:41 PASSED
MOT TEST: 14 August 2012 10:14:41 PASSED

This test (705347422204) was completed on the 14 August 2012 10:14:41 and PASSED the requirements for a valid MOT with 0 comments.

This test (705347422204) was completed on the 14 August 2012 10:14:41 and PASSED the requirements for a valid MOT with 0 comments.

Recorded mileage: 27,517

Recorded mileage: 27,517


MOT TEST: 30 July 2011 09:25:52 PASSED
MOT TEST: 30 July 2011 09:25:52 PASSED

This test (258471811230) was completed on the 30 July 2011 09:25:52 and PASSED the requirements for a valid MOT with 0 comments.

This test (258471811230) was completed on the 30 July 2011 09:25:52 and PASSED the requirements for a valid MOT with 0 comments.

Recorded mileage: 26,459

Recorded mileage: 26,459


MOT TEST: 07 August 2010 09:25:10 PASSED
MOT TEST: 07 August 2010 09:25:10 PASSED

This test (890309610202) was completed on the 07 August 2010 09:25:10 and PASSED the requirements for a valid MOT with 0 comments.

This test (890309610202) was completed on the 07 August 2010 09:25:10 and PASSED the requirements for a valid MOT with 0 comments.

Recorded mileage: 25,518

Recorded mileage: 25,518


MOT TEST: 08 August 2009 09:56:58 PASSED
MOT TEST: 08 August 2009 09:56:58 PASSED

This test (102310629217) was completed on the 08 August 2009 09:56:58 and PASSED the requirements for a valid MOT with 1 comments.

This test (102310629217) was completed on the 08 August 2009 09:56:58 and PASSED the requirements for a valid MOT with 1 comments.

Recorded mileage: 24,625

Recorded mileage: 24,625


ADVISORY


MOT TEST: 09 August 2008 10:15:52 PASSED
MOT TEST: 09 August 2008 10:15:52 PASSED

This test (120972528202) was completed on the 09 August 2008 10:15:52 and PASSED the requirements for a valid MOT with 2 comments.

This test (120972528202) was completed on the 09 August 2008 10:15:52 and PASSED the requirements for a valid MOT with 2 comments.

Recorded mileage: 23,365

Recorded mileage: 23,365


ADVISORY


MOT TEST: 14 August 2007 14:50:49 PASSED
MOT TEST: 14 August 2007 14:50:49 PASSED

This test (774326727245) was completed on the 14 August 2007 14:50:49 and PASSED the requirements for a valid MOT with 0 comments.

This test (774326727245) was completed on the 14 August 2007 14:50:49 and PASSED the requirements for a valid MOT with 0 comments.

Recorded mileage: 21,487

Recorded mileage: 21,487


MOT TEST: 04 August 2007 10:05:00 FAILED
MOT TEST: 04 August 2007 10:05:00 FAILED

This test (350616117266) was completed on the 04 August 2007 10:05:00 and FAILED the requirements for a valid MOT with 3 comments.

This test (350616117266) was completed on the 04 August 2007 10:05:00 and FAILED the requirements for a valid MOT with 3 comments.

Recorded mileage: 21,487

Recorded mileage: 21,487


FAIL


MOT TEST: 08 August 2006 16:55:53 PASSED
MOT TEST: 08 August 2006 16:55:53 PASSED

This test (151230826224) was completed on the 08 August 2006 16:55:53 and PASSED the requirements for a valid MOT with 3 comments.

This test (151230826224) was completed on the 08 August 2006 16:55:53 and PASSED the requirements for a valid MOT with 3 comments.

Recorded mileage: 18,526

Recorded mileage: 18,526


ADVISORY

USER ENTERED


MOT TEST: 08 August 2006 11:37:17 FAILED
MOT TEST: 08 August 2006 11:37:17 FAILED

This test (840580926280) was completed on the 08 August 2006 11:37:17 and FAILED the requirements for a valid MOT with 6 comments.

This test (840580926280) was completed on the 08 August 2006 11:37:17 and FAILED the requirements for a valid MOT with 6 comments.

Recorded mileage: 18,525

Recorded mileage: 18,525


ADVISORY

FAIL

USER ENTERED