JFB 722


JFB722 is registered to a White 1959, Morris Minor with a Petrol engine. It Failed its most recent MOT Test on the 05 July 2013

13 unique faults (16 Total) reported in its MOT History (10 Tests).

1 common/recurring faults.

70% (7) MOT Pass Rate and a 30% (3) MOT Failure Rate.

99,146 recorded miles.

JFB 722


JFB722 is registered to a White 1959, Morris Minor with a Petrol engine. It Failed its most recent MOT Test on the 05 July 2013

13 unique faults (16 Total) reported in its MOT History (10 Tests).

1 common/recurring faults.

70% (7) MOT Pass Rate and a 30% (3) MOT Failure Rate.

99,146 recorded miles.

MOT PASS/Failure rate for JFB 722

all MOT test results for JFB 722 represented as a percentage
MOT PASS/Failure rate for JFB 722
all MOT test results for JFB 722 represented as a percentage

PERCENTAGE OF VEHICLE FAULTS WITH JFB 722

ALL REPORTED FAULTS, DISPLAYED BY PERCENTAGE OF OCCURRENCE DURING ALL MOT TESTS
PERCENTAGE OF VEHICLE FAULTS WITH JFB 722
ALL REPORTED FAULTS, DISPLAYED BY PERCENTAGE OF OCCURRENCE DURING ALL MOT TESTS
FAIL

USER ENTERED

JFB 722 annual Faults by type

ALL REPORTED FAULTS, DISPLAYED over time and categorised by type
JFB 722 annual Faults by type
ALL REPORTED FAULTS, DISPLAYED over time and categorised by type

ALL JFB 722 Failure Faults [14]

ALL Failure faults, ORDERED by OCCURRENCE DURING JFB 722's MOT HISTORY
ALL JFB 722 Failure Faults [14]
ALL Failure faults, ORDERED by OCCURRENCE DURING JFB 722's MOT HISTORY
Fail Faults | source www.vehiclestats.co.uk
Fault Fault Test Date Test Date/Time Reference MOT Test Reference
1 Offside rear suspension spring mounting prescribed area is excessively corroded (2.4.a.3) Offside rear suspension spring mounting prescribed area is excessively corroded (2.4.a.3) 15 December 2008 [10:06] 15/12/2008 983580558366 983580558366
1 Windscreen washer provides insufficient washer liquid (8.2.3) Windscreen washer provides insufficient washer liquid (8.2.3) 17 December 2007 [16:14] 17/12/2007 481891257469 481891257469
1 Front registration plate missing (6.3.1a) Front registration plate missing (6.3.1a) 17 December 2007 [16:14] 17/12/2007 481891257469 481891257469
1 Nearside rear suspension spring mounting prescribed area is excessively corroded (2.4.a.3) Nearside rear suspension spring mounting prescribed area is excessively corroded (2.4.a.3) 17 December 2007 [16:14] 17/12/2007 481891257469 481891257469
1 Offside headlamp not working on dipped beam (1.7.5a) Offside headlamp not working on dipped beam (1.7.5a) 21 December 2005 [15:42] 21/12/2005 370245155385 370245155385
1 Offside headlamp not working on main beam (1.7.5a) Offside headlamp not working on main beam (1.7.5a) 21 December 2005 [15:42] 21/12/2005 370245155385 370245155385
1 Offside registration plate lamp not working (1.1.5c) Offside registration plate lamp not working (1.1.5c) 21 December 2005 [15:42] 21/12/2005 370245155385 370245155385
1 Nearside rear suspension component mounting prescribed area is excessively corroded (2.4.a.3) Nearside rear suspension component mounting prescribed area is excessively corroded (2.4.a.3) 21 December 2005 [15:42] 21/12/2005 370245155385 370245155385
1 Offside rear suspension component mounting prescribed area is excessively corroded (2.4.a.3) Offside rear suspension component mounting prescribed area is excessively corroded (2.4.a.3) 21 December 2005 [15:42] 21/12/2005 370245155385 370245155385
1 Front exhaust has a major leak of exhaust gases (7.1.2) Front exhaust has a major leak of exhaust gases (7.1.2) 21 December 2005 [15:42] 21/12/2005 370245155385 370245155385
1 Nearside front brake hose excessively deteriorated (3.6.b.4d) Nearside front brake hose excessively deteriorated (3.6.b.4d) 21 December 2005 [15:42] 21/12/2005 370245155385 370245155385
1 Offside front brake hose excessively deteriorated (3.6.b.4d) Offside front brake hose excessively deteriorated (3.6.b.4d) 21 December 2005 [15:42] 21/12/2005 370245155385 370245155385

ALL JFB 722 User Entered Faults [2]

ALL User Entered faults, ORDERED by OCCURRENCE DURING JFB 722's MOT HISTORY
ALL JFB 722 User Entered Faults [2]
ALL User Entered faults, ORDERED by OCCURRENCE DURING JFB 722's MOT HISTORY
User Entered Faults | source www.vehiclestats.co.uk
Fault Fault Test Date Test Date/Time Reference MOT Test Reference
2 Both front lower suspension trunions slight play Both front lower suspension trunions slight play 19 December 2007 [12:35] 19/12/2007 17 December 2007 [16:14] 17/12/2007 682493457394 682493457394 481891257469 481891257469

MOT TEST: 05 July 2013 16:13:47 PASSED
MOT TEST: 05 July 2013 16:13:47 PASSED

This test (226126283103) was completed on the 05 July 2013 16:13:47 and PASSED the requirements for a valid MOT with 0 comments.

This test (226126283103) was completed on the 05 July 2013 16:13:47 and PASSED the requirements for a valid MOT with 0 comments.

Recorded mileage: 1,045

Recorded mileage: 1,045


MOT TEST: 02 October 2012 08:47:16 PASSED
MOT TEST: 02 October 2012 08:47:16 PASSED

This test (258736472264) was completed on the 02 October 2012 08:47:16 and PASSED the requirements for a valid MOT with 0 comments.

This test (258736472264) was completed on the 02 October 2012 08:47:16 and PASSED the requirements for a valid MOT with 0 comments.

Recorded mileage: 1,012

Recorded mileage: 1,012


MOT TEST: 13 September 2011 08:50:39 PASSED
MOT TEST: 13 September 2011 08:50:39 PASSED

This test (455876751226) was completed on the 13 September 2011 08:50:39 and PASSED the requirements for a valid MOT with 0 comments.

This test (455876751226) was completed on the 13 September 2011 08:50:39 and PASSED the requirements for a valid MOT with 0 comments.

Recorded mileage: 944

Recorded mileage: 944


MOT TEST: 26 July 2010 17:01:44 PASSED
MOT TEST: 26 July 2010 17:01:44 PASSED

This test (673777500257) was completed on the 26 July 2010 17:01:44 and PASSED the requirements for a valid MOT with 0 comments.

This test (673777500257) was completed on the 26 July 2010 17:01:44 and PASSED the requirements for a valid MOT with 0 comments.

Recorded mileage: 792

Recorded mileage: 792


MOT TEST: 15 December 2008 15:02:19 PASSED
MOT TEST: 15 December 2008 15:02:19 PASSED

This test (220570558376) was completed on the 15 December 2008 15:02:19 and PASSED the requirements for a valid MOT with 0 comments.

This test (220570558376) was completed on the 15 December 2008 15:02:19 and PASSED the requirements for a valid MOT with 0 comments.

Recorded mileage: 73

Recorded mileage: 73


MOT TEST: 15 December 2008 10:06:27 FAILED
MOT TEST: 15 December 2008 10:06:27 FAILED

This test (983580558366) was completed on the 15 December 2008 10:06:27 and FAILED the requirements for a valid MOT with 1 comments.

This test (983580558366) was completed on the 15 December 2008 10:06:27 and FAILED the requirements for a valid MOT with 1 comments.

Recorded mileage: 68

Recorded mileage: 68


FAIL


MOT TEST: 19 December 2007 12:35:05 PASSED
MOT TEST: 19 December 2007 12:35:05 PASSED

This test (682493457394) was completed on the 19 December 2007 12:35:05 and PASSED the requirements for a valid MOT with 1 comments.

This test (682493457394) was completed on the 19 December 2007 12:35:05 and PASSED the requirements for a valid MOT with 1 comments.

Recorded mileage: 59,150

Recorded mileage: 59,150


USER ENTERED


MOT TEST: 17 December 2007 16:14:58 FAILED
MOT TEST: 17 December 2007 16:14:58 FAILED

This test (481891257469) was completed on the 17 December 2007 16:14:58 and FAILED the requirements for a valid MOT with 4 comments.

This test (481891257469) was completed on the 17 December 2007 16:14:58 and FAILED the requirements for a valid MOT with 4 comments.

Recorded mileage: 59,147

Recorded mileage: 59,147


FAIL

USER ENTERED


MOT TEST: 20 January 2006 12:37:22 PASSED
MOT TEST: 20 January 2006 12:37:22 PASSED

This test (172510226415) was completed on the 20 January 2006 12:37:22 and PASSED the requirements for a valid MOT with 0 comments.

This test (172510226415) was completed on the 20 January 2006 12:37:22 and PASSED the requirements for a valid MOT with 0 comments.

Recorded mileage: 99,146

Recorded mileage: 99,146


MOT TEST: 21 December 2005 15:42:47 FAILED
MOT TEST: 21 December 2005 15:42:47 FAILED

This test (370245155385) was completed on the 21 December 2005 15:42:47 and FAILED the requirements for a valid MOT with 10 comments.

This test (370245155385) was completed on the 21 December 2005 15:42:47 and FAILED the requirements for a valid MOT with 10 comments.

Recorded mileage: 99,146

Recorded mileage: 99,146


FAIL