JFF 814H


JFF814H is registered to a Blue 1969, Morris Minor with a Petrol engine. It Failed its most recent MOT Test on the 21 August 2017

38 unique faults (47 Total) reported in its MOT History (13 Tests).

7 common/recurring faults, the most frequent (4 times) is: Offside Front wheel bearing has slight play (2.5.A.3c).

54% (7) MOT Pass Rate and a 46% (6) MOT Failure Rate.

98,541 recorded miles.

JFF 814H


JFF814H is registered to a Blue 1969, Morris Minor with a Petrol engine. It Failed its most recent MOT Test on the 21 August 2017

38 unique faults (47 Total) reported in its MOT History (13 Tests).

7 common/recurring faults, the most frequent (4 times) is: Offside Front wheel bearing has slight play (2.5.A.3c).

54% (7) MOT Pass Rate and a 46% (6) MOT Failure Rate.

98,541 recorded miles.

MOT PASS/Failure rate for JFF 814H

all MOT test results for JFF 814H represented as a percentage
MOT PASS/Failure rate for JFF 814H
all MOT test results for JFF 814H represented as a percentage

PERCENTAGE OF VEHICLE FAULTS WITH JFF 814H

ALL REPORTED FAULTS, DISPLAYED BY PERCENTAGE OF OCCURRENCE DURING ALL MOT TESTS
PERCENTAGE OF VEHICLE FAULTS WITH JFF 814H
ALL REPORTED FAULTS, DISPLAYED BY PERCENTAGE OF OCCURRENCE DURING ALL MOT TESTS
ADVISORY

FAIL

USER ENTERED

JFF 814H annual Faults by type

ALL REPORTED FAULTS, DISPLAYED over time and categorised by type
JFF 814H annual Faults by type
ALL REPORTED FAULTS, DISPLAYED over time and categorised by type

RECURRING FAULTS WITH JFF 814H

FAULTS THAT HAVE OCCURED MORE THAN ONCE DURING JFF 814H's MOT HISTORY
RECURRING FAULTS WITH JFF 814H
FAULTS THAT HAVE OCCURED MORE THAN ONCE DURING JFF 814H's MOT HISTORY
Fault Fault Test Date Test Date/Time Reference MOT Test Reference
4 Offside front wheel bearing has slight play (2.5.a.3c) Offside front wheel bearing has slight play (2.5.a.3c) 30 October 2012 [09:49] 30/10/2012 30 October 2012 [09:19] 30/10/2012 30 January 2012 [12:21] 30/01/2012 19 January 2012 [14:11] 19/01/2012 418774602379 418774602379 998964902383 998964902383 166600732498 166600732498 945219112040 945219112040
2 Service brake: efficiency below requirements (3.7.b.7) Service brake: efficiency below requirements (3.7.b.7) 14 August 2017 [08:05] 14/08/2017 25 November 2008 [17:10] 25/11/2008 869556209255 869556209255 274940738398 274940738398
2 Exhaust has a minor leak of exhaust gases (7.1.2) Exhaust has a minor leak of exhaust gases (7.1.2) 14 November 2013 [15:19] 14/11/2013 31 October 2013 [13:26] 31/10/2013 675738613316 675738613316 288364803383 288364803383
2 Nearside steering rack gaiter deteriorated (2.2.d.2d) Nearside steering rack gaiter deteriorated (2.2.d.2d) 14 November 2013 [15:19] 14/11/2013 31 October 2013 [13:26] 31/10/2013 675738613316 675738613316 288364803383 288364803383
2 Offside front suspension component mounting prescribed area is corroded but not considered excessive (2.4.a.3) Offside front suspension component mounting prescribed area is corroded but not considered excessive (2.4.a.3) 14 November 2013 [15:19] 14/11/2013 31 October 2013 [13:26] 31/10/2013 675738613316 675738613316 288364803383 288364803383
2 Os and ns rear crossmember have been repaired and covered with underseal in suspension spring mounting perscribed areas (signs of filler) Os and ns rear crossmember have been repaired and covered with underseal in suspension spring mounting perscribed areas (signs of filler) 14 November 2013 [15:19] 14/11/2013 31 October 2013 [13:26] 31/10/2013 675738613316 675738613316 288364803383 288364803383
2 Oil leak Oil leak 30 January 2012 [12:21] 30/01/2012 19 January 2012 [14:11] 19/01/2012 166600732498 166600732498 945219112040 945219112040

ALL JFF 814H ADVISORIES [10]

ALL ADVISORIES, ORDERED by OCCURRENCE DURING JFF 814H's MOT HISTORY
ALL JFF 814H ADVISORIES [10]
ALL ADVISORIES, ORDERED by OCCURRENCE DURING JFF 814H's MOT HISTORY
Advisory Faults | source www.vehiclestats.co.uk
Fault Fault Test Date Test Date/Time Reference MOT Test Reference
4 Offside front wheel bearing has slight play (2.5.a.3c) Offside front wheel bearing has slight play (2.5.a.3c) 30 October 2012 [09:49] 30/10/2012 30 October 2012 [09:19] 30/10/2012 30 January 2012 [12:21] 30/01/2012 19 January 2012 [14:11] 19/01/2012 418774602379 418774602379 998964902383 998964902383 166600732498 166600732498 945219112040 945219112040
2 Exhaust has a minor leak of exhaust gases (7.1.2) Exhaust has a minor leak of exhaust gases (7.1.2) 14 November 2013 [15:19] 14/11/2013 31 October 2013 [13:26] 31/10/2013 675738613316 675738613316 288364803383 288364803383
2 Nearside steering rack gaiter deteriorated (2.2.d.2d) Nearside steering rack gaiter deteriorated (2.2.d.2d) 14 November 2013 [15:19] 14/11/2013 31 October 2013 [13:26] 31/10/2013 675738613316 675738613316 288364803383 288364803383
2 Offside front suspension component mounting prescribed area is corroded but not considered excessive (2.4.a.3) Offside front suspension component mounting prescribed area is corroded but not considered excessive (2.4.a.3) 14 November 2013 [15:19] 14/11/2013 31 October 2013 [13:26] 31/10/2013 675738613316 675738613316 288364803383 288364803383

ALL JFF 814H Failure Faults [29]

ALL Failure faults, ORDERED by OCCURRENCE DURING JFF 814H's MOT HISTORY
ALL JFF 814H Failure Faults [29]
ALL Failure faults, ORDERED by OCCURRENCE DURING JFF 814H's MOT HISTORY
Fail Faults | source www.vehiclestats.co.uk
Fault Fault Test Date Test Date/Time Reference MOT Test Reference
2 Service brake: efficiency below requirements (3.7.b.7) Service brake: efficiency below requirements (3.7.b.7) 14 August 2017 [08:05] 14/08/2017 25 November 2008 [17:10] 25/11/2008 869556209255 869556209255 274940738398 274940738398
1 Windscreen washer provides insufficient washer liquid (8.2.3) Windscreen washer provides insufficient washer liquid (8.2.3) 14 August 2017 [08:05] 14/08/2017 869556209255 869556209255
1 Registration plate lamp not working (1.1.c.1d) Registration plate lamp not working (1.1.c.1d) 14 August 2017 [08:05] 14/08/2017 869556209255 869556209255
1 Steering wheel retaining device insecure (2.1.6) Steering wheel retaining device insecure (2.1.6) 31 October 2013 [13:26] 31/10/2013 288364803383 288364803383
1 Nearside suspension component mounting prescribed area is inadequately repaired (2.4.a.3) Nearside suspension component mounting prescribed area is inadequately repaired (2.4.a.3) 31 October 2013 [13:26] 31/10/2013 288364803383 288364803383
1 Suspension spring mounting prescribed area is inadequately repaired (2.4.a.3) Suspension spring mounting prescribed area is inadequately repaired (2.4.a.3) 31 October 2013 [13:26] 31/10/2013 288364803383 288364803383
1 Nearside rear suspension spring mounting prescribed area is inadequately repaired (2.4.a.3) Nearside rear suspension spring mounting prescribed area is inadequately repaired (2.4.a.3) 31 October 2013 [13:26] 31/10/2013 288364803383 288364803383
1 Offside rear suspension spring mounting prescribed area is excessively corroded (2.4.a.3) Offside rear suspension spring mounting prescribed area is excessively corroded (2.4.a.3) 31 October 2013 [13:26] 31/10/2013 288364803383 288364803383
1 Offside rear tyre tread depth below requirements of 1.6mm (4.1.e.1) Offside rear tyre tread depth below requirements of 1.6mm (4.1.e.1) 31 October 2013 [13:26] 31/10/2013 288364803383 288364803383
1 Front tyre(s) incorrect because different size tyres are fitted on the same axle. (4.1.a.1a) Front tyre(s) incorrect because different size tyres are fitted on the same axle. (4.1.a.1a) 31 October 2013 [13:26] 31/10/2013 288364803383 288364803383
1 Rear tyre(s) incorrect because different size tyres are fitted on the same axle. (4.1.a.1a) Rear tyre(s) incorrect because different size tyres are fitted on the same axle. (4.1.a.1a) 31 October 2013 [13:26] 31/10/2013 288364803383 288364803383
1 Headlamp aim too low (1.8) Headlamp aim too low (1.8) 31 October 2013 [13:26] 31/10/2013 288364803383 288364803383
1 Offside headlamp aim too high (1.8) Offside headlamp aim too high (1.8) 30 October 2012 [09:19] 30/10/2012 998964902383 998964902383
1 Nearside stop lamp not working (1.2.1b) Nearside stop lamp not working (1.2.1b) 30 October 2012 [09:19] 30/10/2012 998964902383 998964902383
1 Offside headlamp not working on main beam (1.7.5a) Offside headlamp not working on main beam (1.7.5a) 19 January 2012 [14:11] 19/01/2012 945219112040 945219112040
1 Nearside front brake binding (3.7.b.1) Nearside front brake binding (3.7.b.1) 19 January 2012 [14:11] 19/01/2012 945219112040 945219112040
1 Offside steering rack gaiter split (2.2.d.2d) Offside steering rack gaiter split (2.2.d.2d) 19 January 2012 [14:11] 19/01/2012 945219112040 945219112040
1 Brakes imbalanced across an axle (3.7.b.5b) Brakes imbalanced across an axle (3.7.b.5b) 19 January 2012 [14:11] 19/01/2012 945219112040 945219112040
1 Nearside rear tyre has a tear, caused by separation or partial failure of its structure (4.1.d.1b) Nearside rear tyre has a tear, caused by separation or partial failure of its structure (4.1.d.1b) 13 May 2009 [15:44] 13/05/2009 272433039458 272433039458
1 Indicator tell tale inoperative (1.4.a.2a) Indicator tell tale inoperative (1.4.a.2a) 25 November 2008 [17:10] 25/11/2008 274940738398 274940738398
1 Front windscreen washer provides insufficient washer liquid (8.2.3) Front windscreen washer provides insufficient washer liquid (8.2.3) 25 November 2008 [17:10] 25/11/2008 274940738398 274940738398
1 Horn not working (1.6.2a) Horn not working (1.6.2a) 25 November 2008 [17:10] 25/11/2008 274940738398 274940738398
1 Nearside rear position lamp(s) excessively deteriorated so that it is not visible from a reasonable distance (1.1.a.3d) Nearside rear position lamp(s) excessively deteriorated so that it is not visible from a reasonable distance (1.1.a.3d) 25 November 2008 [17:10] 25/11/2008 274940738398 274940738398
1 Offside rear registration plate lamp not working (1.1.5c) Offside rear registration plate lamp not working (1.1.5c) 25 November 2008 [17:10] 25/11/2008 274940738398 274940738398
1 Fuel cap/sealing device does not fasten securely maintaining the sealing arrangement (7.2.4b) Fuel cap/sealing device does not fasten securely maintaining the sealing arrangement (7.2.4b) 25 November 2008 [17:10] 25/11/2008 274940738398 274940738398
1 Offside rear brake recording little or no effort (3.7.b.5a) Offside rear brake recording little or no effort (3.7.b.5a) 25 November 2008 [17:10] 25/11/2008 274940738398 274940738398
1 Offside rear parking brake recording little or no effort (3.7.b.6a) Offside rear parking brake recording little or no effort (3.7.b.6a) 25 November 2008 [17:10] 25/11/2008 274940738398 274940738398
1 Parking brake: efficiency below requirements (3.7.b.7) Parking brake: efficiency below requirements (3.7.b.7) 25 November 2008 [17:10] 25/11/2008 274940738398 274940738398

ALL JFF 814H User Entered Faults [8]

ALL User Entered faults, ORDERED by OCCURRENCE DURING JFF 814H's MOT HISTORY
ALL JFF 814H User Entered Faults [8]
ALL User Entered faults, ORDERED by OCCURRENCE DURING JFF 814H's MOT HISTORY
Advisory Faults | source www.vehiclestats.co.uk
Fault Fault Test Date Test Date/Time Reference MOT Test Reference
2 Os and ns rear crossmember have been repaired and covered with underseal in suspension spring mounting perscribed areas (signs of filler) Os and ns rear crossmember have been repaired and covered with underseal in suspension spring mounting perscribed areas (signs of filler) 14 November 2013 [15:19] 14/11/2013 31 October 2013 [13:26] 31/10/2013 675738613316 675738613316 288364803383 288364803383
2 Oil leak Oil leak 30 January 2012 [12:21] 30/01/2012 19 January 2012 [14:11] 19/01/2012 166600732498 166600732498 945219112040 945219112040
1 Welding repairs covered with underseal and signs of body filler Welding repairs covered with underseal and signs of body filler 14 November 2013 [15:19] 14/11/2013 675738613316 675738613316
1 Propshaft flange bolts loose Propshaft flange bolts loose 31 October 2013 [13:26] 31/10/2013 288364803383 288364803383
1 Nail in nearside front tyre Nail in nearside front tyre 31 October 2013 [13:26] 31/10/2013 288364803383 288364803383
1 Coolant leak Coolant leak 19 January 2012 [14:11] 19/01/2012 945219112040 945219112040

MOT TEST: 21 August 2017 13:42:18 PASSED
MOT TEST: 21 August 2017 13:42:18 PASSED

This test (244333916591) was completed on the 21 August 2017 13:42:18 and PASSED the requirements for a valid MOT with 0 comments.

This test (244333916591) was completed on the 21 August 2017 13:42:18 and PASSED the requirements for a valid MOT with 0 comments.

Recorded mileage: 936

Recorded mileage: 936


MOT TEST: 14 August 2017 08:05:50 FAILED
MOT TEST: 14 August 2017 08:05:50 FAILED

This test (869556209255) was completed on the 14 August 2017 08:05:50 and FAILED the requirements for a valid MOT with 3 comments.

This test (869556209255) was completed on the 14 August 2017 08:05:50 and FAILED the requirements for a valid MOT with 3 comments.

Recorded mileage: 936

Recorded mileage: 936


FAIL


MOT TEST: 26 March 2015 15:53:14 PASSED
MOT TEST: 26 March 2015 15:53:14 PASSED

This test (207445185015) was completed on the 26 March 2015 15:53:14 and PASSED the requirements for a valid MOT with 0 comments.

This test (207445185015) was completed on the 26 March 2015 15:53:14 and PASSED the requirements for a valid MOT with 0 comments.

Recorded mileage: 842

Recorded mileage: 842


MOT TEST: 14 November 2013 15:19:33 PASSED
MOT TEST: 14 November 2013 15:19:33 PASSED

This test (675738613316) was completed on the 14 November 2013 15:19:33 and PASSED the requirements for a valid MOT with 5 comments.

This test (675738613316) was completed on the 14 November 2013 15:19:33 and PASSED the requirements for a valid MOT with 5 comments.

Recorded mileage: 0

Recorded mileage: 0


ADVISORY

USER ENTERED


MOT TEST: 31 October 2013 13:26:42 FAILED
MOT TEST: 31 October 2013 13:26:42 FAILED

This test (288364803383) was completed on the 31 October 2013 13:26:42 and FAILED the requirements for a valid MOT with 15 comments.

This test (288364803383) was completed on the 31 October 2013 13:26:42 and FAILED the requirements for a valid MOT with 15 comments.

Recorded mileage: 0

Recorded mileage: 0


ADVISORY

FAIL

USER ENTERED


MOT TEST: 30 October 2012 09:49:36 PASSED
MOT TEST: 30 October 2012 09:49:36 PASSED

This test (418774602379) was completed on the 30 October 2012 09:49:36 and PASSED the requirements for a valid MOT with 1 comments.

This test (418774602379) was completed on the 30 October 2012 09:49:36 and PASSED the requirements for a valid MOT with 1 comments.

Recorded mileage: 98,541

Recorded mileage: 98,541


ADVISORY


MOT TEST: 30 October 2012 09:19:26 FAILED
MOT TEST: 30 October 2012 09:19:26 FAILED

This test (998964902383) was completed on the 30 October 2012 09:19:26 and FAILED the requirements for a valid MOT with 3 comments.

This test (998964902383) was completed on the 30 October 2012 09:19:26 and FAILED the requirements for a valid MOT with 3 comments.

Recorded mileage: 98,541

Recorded mileage: 98,541


ADVISORY

FAIL


MOT TEST: 30 January 2012 12:21:19 PASSED
MOT TEST: 30 January 2012 12:21:19 PASSED

This test (166600732498) was completed on the 30 January 2012 12:21:19 and PASSED the requirements for a valid MOT with 2 comments.

This test (166600732498) was completed on the 30 January 2012 12:21:19 and PASSED the requirements for a valid MOT with 2 comments.

Recorded mileage: 98,491

Recorded mileage: 98,491


ADVISORY

USER ENTERED


MOT TEST: 19 January 2012 14:11:24 FAILED
MOT TEST: 19 January 2012 14:11:24 FAILED

This test (945219112040) was completed on the 19 January 2012 14:11:24 and FAILED the requirements for a valid MOT with 7 comments.

This test (945219112040) was completed on the 19 January 2012 14:11:24 and FAILED the requirements for a valid MOT with 7 comments.

Recorded mileage: 98,489

Recorded mileage: 98,489


ADVISORY

FAIL

USER ENTERED


MOT TEST: 14 May 2009 13:43:36 PASSED
MOT TEST: 14 May 2009 13:43:36 PASSED

This test (993014239167) was completed on the 14 May 2009 13:43:36 and PASSED the requirements for a valid MOT with 0 comments.

This test (993014239167) was completed on the 14 May 2009 13:43:36 and PASSED the requirements for a valid MOT with 0 comments.

Recorded mileage: 98,481

Recorded mileage: 98,481


MOT TEST: 13 May 2009 15:44:16 FAILED
MOT TEST: 13 May 2009 15:44:16 FAILED

This test (272433039458) was completed on the 13 May 2009 15:44:16 and FAILED the requirements for a valid MOT with 1 comments.

This test (272433039458) was completed on the 13 May 2009 15:44:16 and FAILED the requirements for a valid MOT with 1 comments.

Recorded mileage: 98,476

Recorded mileage: 98,476


FAIL


MOT TEST: 25 November 2008 17:10:44 FAILED
MOT TEST: 25 November 2008 17:10:44 FAILED

This test (274940738398) was completed on the 25 November 2008 17:10:44 and FAILED the requirements for a valid MOT with 10 comments.

This test (274940738398) was completed on the 25 November 2008 17:10:44 and FAILED the requirements for a valid MOT with 10 comments.

Recorded mileage: 98,463

Recorded mileage: 98,463


FAIL


MOT TEST: 28 April 2008 11:30:10 PASSED
MOT TEST: 28 April 2008 11:30:10 PASSED

This test (511509218105) was completed on the 28 April 2008 11:30:10 and PASSED the requirements for a valid MOT with 0 comments.

This test (511509218105) was completed on the 28 April 2008 11:30:10 and PASSED the requirements for a valid MOT with 0 comments.

Recorded mileage: 98,299

Recorded mileage: 98,299