JFH 286K


JFH286K is registered to a Gold 1971, Morris Marina 1.3 deluxe with a Petrol engine. It Failed its most recent MOT Test on the 11 December 2006

13 unique faults (13 Total) reported in its MOT History (4 Tests).

0 common/recurring faults.

50% (2) MOT Pass Rate and a 50% (2) MOT Failure Rate.

7,814 recorded miles.

JFH 286K


JFH286K is registered to a Gold 1971, Morris Marina 1.3 deluxe with a Petrol engine. It Failed its most recent MOT Test on the 11 December 2006

13 unique faults (13 Total) reported in its MOT History (4 Tests).

0 common/recurring faults.

50% (2) MOT Pass Rate and a 50% (2) MOT Failure Rate.

7,814 recorded miles.

MOT PASS/Failure rate for JFH 286K

all MOT test results for JFH 286K represented as a percentage
MOT PASS/Failure rate for JFH 286K
all MOT test results for JFH 286K represented as a percentage

PERCENTAGE OF VEHICLE FAULTS WITH JFH 286K

ALL REPORTED FAULTS, DISPLAYED BY PERCENTAGE OF OCCURRENCE DURING ALL MOT TESTS
PERCENTAGE OF VEHICLE FAULTS WITH JFH 286K
ALL REPORTED FAULTS, DISPLAYED BY PERCENTAGE OF OCCURRENCE DURING ALL MOT TESTS
ADVISORY

FAIL

USER ENTERED

JFH 286K annual Faults by type

ALL REPORTED FAULTS, DISPLAYED over time and categorised by type
JFH 286K annual Faults by type
ALL REPORTED FAULTS, DISPLAYED over time and categorised by type

ALL JFH 286K ADVISORIES [1]

ALL ADVISORIES, ORDERED by OCCURRENCE DURING JFH 286K's MOT HISTORY
ALL JFH 286K ADVISORIES [1]
ALL ADVISORIES, ORDERED by OCCURRENCE DURING JFH 286K's MOT HISTORY
Advisory Faults | source www.vehiclestats.co.uk
Fault Fault Test Date Test Date/Time Reference MOT Test Reference
1 Nearside front tie bar/rod rubber bush deteriorated but not resulting in excessive movement (2.4.g.2) Nearside front tie bar/rod rubber bush deteriorated but not resulting in excessive movement (2.4.g.2) 11 December 2006 [15:03] 11/12/2006 923715446306 923715446306

ALL JFH 286K Failure Faults [10]

ALL Failure faults, ORDERED by OCCURRENCE DURING JFH 286K's MOT HISTORY
ALL JFH 286K Failure Faults [10]
ALL Failure faults, ORDERED by OCCURRENCE DURING JFH 286K's MOT HISTORY
Fail Faults | source www.vehiclestats.co.uk
Fault Fault Test Date Test Date/Time Reference MOT Test Reference
1 Nearside front upper suspension arm rubber bush deteriorated resulting in excessive movement (2.4.g.2) Nearside front upper suspension arm rubber bush deteriorated resulting in excessive movement (2.4.g.2) 07 November 2006 [18:16] 07/11/2006 413051516457 413051516457
1 Offside steering rack gaiter split (2.2.d.2d) Offside steering rack gaiter split (2.2.d.2d) 07 November 2006 [18:16] 07/11/2006 413051516457 413051516457
1 Nearside rear suspension spring mounting prescribed area is excessively corroded (2.4.a.3) Nearside rear suspension spring mounting prescribed area is excessively corroded (2.4.a.3) 07 November 2006 [18:16] 07/11/2006 413051516457 413051516457
1 Nearside front seat belt anchorage prescribed area is excessively corroded (5.2.6) Nearside front seat belt anchorage prescribed area is excessively corroded (5.2.6) 07 November 2006 [18:16] 07/11/2006 413051516457 413051516457
1 Offside front seat belt anchorage prescribed area is excessively corroded (5.2.6) Offside front seat belt anchorage prescribed area is excessively corroded (5.2.6) 07 November 2006 [18:16] 07/11/2006 413051516457 413051516457
1 Nearside front tyre tread depth below requirements of 1.6mm (4.1.e.1) Nearside front tyre tread depth below requirements of 1.6mm (4.1.e.1) 07 November 2006 [18:16] 07/11/2006 413051516457 413051516457
1 Service brake: efficiency below requirements (3.7.b.7) Service brake: efficiency below requirements (3.7.b.7) 07 November 2006 [18:16] 07/11/2006 413051516457 413051516457
1 Parking brake: efficiency below requirements (3.7.b.7) Parking brake: efficiency below requirements (3.7.b.7) 07 November 2006 [18:16] 07/11/2006 413051516457 413051516457
1 Nearside rear leaf spring anchor bracket corroded and seriously weakened (2.4.b.6d) Nearside rear leaf spring anchor bracket corroded and seriously weakened (2.4.b.6d) 22 September 2005 [14:50] 22/09/2005 734875965217 734875965217
1 Nearside front lower shock absorber has an excessively worn bush (2.7.4) Nearside front lower shock absorber has an excessively worn bush (2.7.4) 22 September 2005 [14:50] 22/09/2005 734875965217 734875965217

ALL JFH 286K User Entered Faults [2]

ALL User Entered faults, ORDERED by OCCURRENCE DURING JFH 286K's MOT HISTORY
ALL JFH 286K User Entered Faults [2]
ALL User Entered faults, ORDERED by OCCURRENCE DURING JFH 286K's MOT HISTORY
Advisory Faults | source www.vehiclestats.co.uk
Fault Fault Test Date Test Date/Time Reference MOT Test Reference
1 Slight play in steering Slight play in steering 11 December 2006 [15:03] 11/12/2006 923715446306 923715446306
1 Propshaft middle bush perished Propshaft middle bush perished 22 September 2005 [14:50] 22/09/2005 734875965217 734875965217

MOT TEST: 11 December 2006 15:03:16 PASSED
MOT TEST: 11 December 2006 15:03:16 PASSED

This test (923715446306) was completed on the 11 December 2006 15:03:16 and PASSED the requirements for a valid MOT with 2 comments.

This test (923715446306) was completed on the 11 December 2006 15:03:16 and PASSED the requirements for a valid MOT with 2 comments.

Recorded mileage: 7,814

Recorded mileage: 7,814


ADVISORY

USER ENTERED


MOT TEST: 07 November 2006 18:16:48 FAILED
MOT TEST: 07 November 2006 18:16:48 FAILED

This test (413051516457) was completed on the 07 November 2006 18:16:48 and FAILED the requirements for a valid MOT with 8 comments.

This test (413051516457) was completed on the 07 November 2006 18:16:48 and FAILED the requirements for a valid MOT with 8 comments.

Recorded mileage: 7,808

Recorded mileage: 7,808


FAIL


MOT TEST: 06 December 2005 09:08:30 PASSED
MOT TEST: 06 December 2005 09:08:30 PASSED

This test (340719935373) was completed on the 06 December 2005 09:08:30 and PASSED the requirements for a valid MOT with 0 comments.

This test (340719935373) was completed on the 06 December 2005 09:08:30 and PASSED the requirements for a valid MOT with 0 comments.

Recorded mileage: 5,850

Recorded mileage: 5,850


MOT TEST: 22 September 2005 14:50:58 FAILED
MOT TEST: 22 September 2005 14:50:58 FAILED

This test (734875965217) was completed on the 22 September 2005 14:50:58 and FAILED the requirements for a valid MOT with 3 comments.

This test (734875965217) was completed on the 22 September 2005 14:50:58 and FAILED the requirements for a valid MOT with 3 comments.

Recorded mileage: 5,844

Recorded mileage: 5,844


FAIL

USER ENTERED