JFK 466H


JFK466H is registered to a White 1970, Morris Minor 1000 with a Petrol engine. It Failed its most recent MOT Test on the 10 May 2016

7 unique faults (9 Total) reported in its MOT History (6 Tests).

2 common/recurring faults, the most frequent (2 times) is: Nearside Front Brake pipe slightly corroded (3.6.B.2c).

50% (3) MOT Pass Rate and a 50% (3) MOT Failure Rate.

21,166 recorded miles.

JFK 466H


JFK466H is registered to a White 1970, Morris Minor 1000 with a Petrol engine. It Failed its most recent MOT Test on the 10 May 2016

7 unique faults (9 Total) reported in its MOT History (6 Tests).

2 common/recurring faults, the most frequent (2 times) is: Nearside Front Brake pipe slightly corroded (3.6.B.2c).

50% (3) MOT Pass Rate and a 50% (3) MOT Failure Rate.

21,166 recorded miles.

MOT PASS/Failure rate for JFK 466H

all MOT test results for JFK 466H represented as a percentage
MOT PASS/Failure rate for JFK 466H
all MOT test results for JFK 466H represented as a percentage

PERCENTAGE OF VEHICLE FAULTS WITH JFK 466H

ALL REPORTED FAULTS, DISPLAYED BY PERCENTAGE OF OCCURRENCE DURING ALL MOT TESTS
PERCENTAGE OF VEHICLE FAULTS WITH JFK 466H
ALL REPORTED FAULTS, DISPLAYED BY PERCENTAGE OF OCCURRENCE DURING ALL MOT TESTS
ADVISORY

FAIL

PASS WITH RECTIFICATION

JFK 466H annual Faults by type

ALL REPORTED FAULTS, DISPLAYED over time and categorised by type
JFK 466H annual Faults by type
ALL REPORTED FAULTS, DISPLAYED over time and categorised by type

RECURRING FAULTS WITH JFK 466H

FAULTS THAT HAVE OCCURED MORE THAN ONCE DURING JFK 466H's MOT HISTORY
RECURRING FAULTS WITH JFK 466H
FAULTS THAT HAVE OCCURED MORE THAN ONCE DURING JFK 466H's MOT HISTORY
Fault Fault Test Date Test Date/Time Reference MOT Test Reference
2 Nearside front brake pipe slightly corroded (3.6.b.2c) Nearside front brake pipe slightly corroded (3.6.b.2c) 10 May 2016 [08:55] 10/05/2016 05 May 2016 [14:14] 05/05/2016 239684076320 239684076320 648207053267 648207053267
2 Rear brake pipe slightly corroded both (3.6.b.2c) Rear brake pipe slightly corroded both (3.6.b.2c) 10 May 2016 [08:55] 10/05/2016 05 May 2016 [14:14] 05/05/2016 239684076320 239684076320 648207053267 648207053267

ALL JFK 466H ADVISORIES [4]

ALL ADVISORIES, ORDERED by OCCURRENCE DURING JFK 466H's MOT HISTORY
ALL JFK 466H ADVISORIES [4]
ALL ADVISORIES, ORDERED by OCCURRENCE DURING JFK 466H's MOT HISTORY
Advisory Faults | source www.vehiclestats.co.uk
Fault Fault Test Date Test Date/Time Reference MOT Test Reference
2 Nearside front brake pipe slightly corroded (3.6.b.2c) Nearside front brake pipe slightly corroded (3.6.b.2c) 10 May 2016 [08:55] 10/05/2016 05 May 2016 [14:14] 05/05/2016 239684076320 239684076320 648207053267 648207053267
2 Rear brake pipe slightly corroded both (3.6.b.2c) Rear brake pipe slightly corroded both (3.6.b.2c) 10 May 2016 [08:55] 10/05/2016 05 May 2016 [14:14] 05/05/2016 239684076320 239684076320 648207053267 648207053267

ALL JFK 466H Failure Faults [4]

ALL Failure faults, ORDERED by OCCURRENCE DURING JFK 466H's MOT HISTORY
ALL JFK 466H Failure Faults [4]
ALL Failure faults, ORDERED by OCCURRENCE DURING JFK 466H's MOT HISTORY
Fail Faults | source www.vehiclestats.co.uk
Fault Fault Test Date Test Date/Time Reference MOT Test Reference
1 Nearside seat belt anchorage prescribed area is excessively corroded sill / floorpan (5.2.6) Nearside seat belt anchorage prescribed area is excessively corroded sill / floorpan (5.2.6) 05 May 2016 [14:14] 05/05/2016 648207053267 648207053267
1 Nearside front steering rack gaiter split (2.2.d.2d) Nearside front steering rack gaiter split (2.2.d.2d) 05 May 2016 [14:14] 05/05/2016 648207053267 648207053267
1 Offside headlamp aim beam image obviously incorrect (1.8.a.1b) Offside headlamp aim beam image obviously incorrect (1.8.a.1b) 08 May 2015 [15:49] 08/05/2015 687118425149 687118425149
1 Offside rear brake binding (3.7.b.1) Offside rear brake binding (3.7.b.1) 08 May 2015 [15:49] 08/05/2015 687118425149 687118425149

ALL JFK 466H Pass With Rectification Faults [1]

ALL Pass With Rectification faults, ORDERED by OCCURRENCE DURING JFK 466H's MOT HISTORY
ALL JFK 466H Pass With Rectification Faults [1]
ALL Pass With Rectification faults, ORDERED by OCCURRENCE DURING JFK 466H's MOT HISTORY
Pass With Rectification Faults | source www.vehiclestats.co.uk
Fault Fault Test Date Test Date/Time Reference MOT Test Reference
1 Nearside headlamp not working on dipped beam (1.7.5a) Nearside headlamp not working on dipped beam (1.7.5a) 17 May 2014 [10:24] 17/05/2014 236307934171 236307934171

MOT TEST: 10 May 2016 08:55:56 PASSED
MOT TEST: 10 May 2016 08:55:56 PASSED

This test (239684076320) was completed on the 10 May 2016 08:55:56 and PASSED the requirements for a valid MOT with 2 comments.

This test (239684076320) was completed on the 10 May 2016 08:55:56 and PASSED the requirements for a valid MOT with 2 comments.

Recorded mileage: 21,166

Recorded mileage: 21,166


ADVISORY


MOT TEST: 05 May 2016 14:14:57 FAILED
MOT TEST: 05 May 2016 14:14:57 FAILED

This test (648207053267) was completed on the 05 May 2016 14:14:57 and FAILED the requirements for a valid MOT with 4 comments.

This test (648207053267) was completed on the 05 May 2016 14:14:57 and FAILED the requirements for a valid MOT with 4 comments.

Recorded mileage: 21,115

Recorded mileage: 21,115


ADVISORY

FAIL


MOT TEST: 09 May 2015 10:18:32 PASSED
MOT TEST: 09 May 2015 10:18:32 PASSED

This test (558499725154) was completed on the 09 May 2015 10:18:32 and PASSED the requirements for a valid MOT with 0 comments.

This test (558499725154) was completed on the 09 May 2015 10:18:32 and PASSED the requirements for a valid MOT with 0 comments.

Recorded mileage: 19,750

Recorded mileage: 19,750


MOT TEST: 08 May 2015 15:49:23 FAILED
MOT TEST: 08 May 2015 15:49:23 FAILED

This test (687118425149) was completed on the 08 May 2015 15:49:23 and FAILED the requirements for a valid MOT with 2 comments.

This test (687118425149) was completed on the 08 May 2015 15:49:23 and FAILED the requirements for a valid MOT with 2 comments.

Recorded mileage: 19,729

Recorded mileage: 19,729


FAIL


MOT TEST: 17 May 2014 10:24:53 PASSED
MOT TEST: 17 May 2014 10:24:53 PASSED

This test (185877434153) was completed on the 17 May 2014 10:24:53 and PASSED the requirements for a valid MOT with 0 comments.

This test (185877434153) was completed on the 17 May 2014 10:24:53 and PASSED the requirements for a valid MOT with 0 comments.

Recorded mileage: 18,755

Recorded mileage: 18,755


MOT TEST: 17 May 2014 10:24:53 FAILED
MOT TEST: 17 May 2014 10:24:53 FAILED

This test (236307934171) was completed on the 17 May 2014 10:24:53 and FAILED the requirements for a valid MOT with 1 comments.

This test (236307934171) was completed on the 17 May 2014 10:24:53 and FAILED the requirements for a valid MOT with 1 comments.

Recorded mileage: 18,755

Recorded mileage: 18,755


PASS WITH RECTIFICATION