JFK 529H


JFK529H is registered to a Grey 1970, Morris Minor with a Petrol engine. It Failed its most recent MOT Test on the 10 July 2017

13 unique faults (14 Total) reported in its MOT History (11 Tests).

1 common/recurring faults.

73% (8) MOT Pass Rate and a 27% (3) MOT Failure Rate.

81,499 recorded miles.

JFK 529H


JFK529H is registered to a Grey 1970, Morris Minor with a Petrol engine. It Failed its most recent MOT Test on the 10 July 2017

13 unique faults (14 Total) reported in its MOT History (11 Tests).

1 common/recurring faults.

73% (8) MOT Pass Rate and a 27% (3) MOT Failure Rate.

81,499 recorded miles.

MOT PASS/Failure rate for JFK 529H

all MOT test results for JFK 529H represented as a percentage
MOT PASS/Failure rate for JFK 529H
all MOT test results for JFK 529H represented as a percentage

PERCENTAGE OF VEHICLE FAULTS WITH JFK 529H

ALL REPORTED FAULTS, DISPLAYED BY PERCENTAGE OF OCCURRENCE DURING ALL MOT TESTS
PERCENTAGE OF VEHICLE FAULTS WITH JFK 529H
ALL REPORTED FAULTS, DISPLAYED BY PERCENTAGE OF OCCURRENCE DURING ALL MOT TESTS
ADVISORY

FAIL

USER ENTERED

PASS WITH RECTIFICATION

JFK 529H annual Faults by type

ALL REPORTED FAULTS, DISPLAYED over time and categorised by type
JFK 529H annual Faults by type
ALL REPORTED FAULTS, DISPLAYED over time and categorised by type

ALL JFK 529H ADVISORIES [5]

ALL ADVISORIES, ORDERED by OCCURRENCE DURING JFK 529H's MOT HISTORY
ALL JFK 529H ADVISORIES [5]
ALL ADVISORIES, ORDERED by OCCURRENCE DURING JFK 529H's MOT HISTORY
Advisory Faults | source www.vehiclestats.co.uk
Fault Fault Test Date Test Date/Time Reference MOT Test Reference
2 Steering column top bearing slightly worn (2.1.2c) Steering column top bearing slightly worn (2.1.2c) 04 June 2013 [09:19] 04/06/2013 04 June 2013 [09:19] 04/06/2013 429585253106 429585253106 208755553444 208755553444
1 Offside front upper suspension arm has slight play in a pin/bearing (2.4.g.2) Offside front upper suspension arm has slight play in a pin/bearing (2.4.g.2) 27 May 2011 [11:33] 27/05/2011 407747341133 407747341133
1 Nearside rear tyre worn close to the legal limit (4.1.e.1) Nearside rear tyre worn close to the legal limit (4.1.e.1) 27 May 2011 [11:33] 27/05/2011 407747341133 407747341133
1 Nearside front tyre worn close to the legal limit (4.1.e.1) Nearside front tyre worn close to the legal limit (4.1.e.1) 27 May 2011 [11:33] 27/05/2011 407747341133 407747341133

ALL JFK 529H Failure Faults [6]

ALL Failure faults, ORDERED by OCCURRENCE DURING JFK 529H's MOT HISTORY
ALL JFK 529H Failure Faults [6]
ALL Failure faults, ORDERED by OCCURRENCE DURING JFK 529H's MOT HISTORY
Fail Faults | source www.vehiclestats.co.uk
Fault Fault Test Date Test Date/Time Reference MOT Test Reference
1 Nearside rear brake recording little or no effort (3.7.b.5a) Nearside rear brake recording little or no effort (3.7.b.5a) 08 June 2015 [09:06] 08/06/2015 355109455128 355109455128
1 Parking brake: efficiency below requirements (3.7.c.1b) Parking brake: efficiency below requirements (3.7.c.1b) 08 June 2015 [09:06] 08/06/2015 355109455128 355109455128
1 Rear stop lamp not working (1.2.1b) Rear stop lamp not working (1.2.1b) 07 June 2012 [09:19] 07/06/2012 358349352185 358349352185
1 Nearside front suspension component mounting prescribed area is excessively corroded (2.4.a.3) Nearside front suspension component mounting prescribed area is excessively corroded (2.4.a.3) 07 June 2012 [09:19] 07/06/2012 358349352185 358349352185
1 Nearside front steering rack gaiter split (2.2.d.2d) Nearside front steering rack gaiter split (2.2.d.2d) 07 June 2012 [09:19] 07/06/2012 358349352185 358349352185
1 Nearside front upper suspension arm has excessive play in a pin/bush (2.4.g.2) Nearside front upper suspension arm has excessive play in a pin/bush (2.4.g.2) 07 June 2012 [09:19] 07/06/2012 358349352185 358349352185

ALL JFK 529H User Entered Faults [2]

ALL User Entered faults, ORDERED by OCCURRENCE DURING JFK 529H's MOT HISTORY
ALL JFK 529H User Entered Faults [2]
ALL User Entered faults, ORDERED by OCCURRENCE DURING JFK 529H's MOT HISTORY
User Entered Faults | source www.vehiclestats.co.uk
Fault Fault Test Date Test Date/Time Reference MOT Test Reference
1 Both rear leaf springs worn - close to chassis at rear shackles Both rear leaf springs worn - close to chassis at rear shackles 07 June 2010 [16:39] 07/06/2010 683378250192 683378250192
1 Brake pedal slightly spongy Brake pedal slightly spongy 07 June 2010 [16:39] 07/06/2010 683378250192 683378250192

ALL JFK 529H Pass With Rectification Faults [1]

ALL Pass With Rectification faults, ORDERED by OCCURRENCE DURING JFK 529H's MOT HISTORY
ALL JFK 529H Pass With Rectification Faults [1]
ALL Pass With Rectification faults, ORDERED by OCCURRENCE DURING JFK 529H's MOT HISTORY
Pass With Rectification Faults | source www.vehiclestats.co.uk
Fault Fault Test Date Test Date/Time Reference MOT Test Reference
1 Nearside stop lamp not working (1.2.1b) Nearside stop lamp not working (1.2.1b) 04 June 2013 [09:19] 04/06/2013 208755553444 208755553444

MOT TEST: 10 July 2017 18:08:30 PASSED
MOT TEST: 10 July 2017 18:08:30 PASSED

This test (740381146789) was completed on the 10 July 2017 18:08:30 and PASSED the requirements for a valid MOT with 0 comments.

This test (740381146789) was completed on the 10 July 2017 18:08:30 and PASSED the requirements for a valid MOT with 0 comments.

Recorded mileage: 81,499

Recorded mileage: 81,499


MOT TEST: 27 June 2016 08:23:20 PASSED
MOT TEST: 27 June 2016 08:23:20 PASSED

This test (697470479573) was completed on the 27 June 2016 08:23:20 and PASSED the requirements for a valid MOT with 0 comments.

This test (697470479573) was completed on the 27 June 2016 08:23:20 and PASSED the requirements for a valid MOT with 0 comments.

Recorded mileage: 77,889

Recorded mileage: 77,889


MOT TEST: 19 June 2015 14:06:08 PASSED
MOT TEST: 19 June 2015 14:06:08 PASSED

This test (489630175115) was completed on the 19 June 2015 14:06:08 and PASSED the requirements for a valid MOT with 0 comments.

This test (489630175115) was completed on the 19 June 2015 14:06:08 and PASSED the requirements for a valid MOT with 0 comments.

Recorded mileage: 75,188

Recorded mileage: 75,188


MOT TEST: 08 June 2015 09:06:31 FAILED
MOT TEST: 08 June 2015 09:06:31 FAILED

This test (355109455128) was completed on the 08 June 2015 09:06:31 and FAILED the requirements for a valid MOT with 2 comments.

This test (355109455128) was completed on the 08 June 2015 09:06:31 and FAILED the requirements for a valid MOT with 2 comments.

Recorded mileage: 75,134

Recorded mileage: 75,134


FAIL


MOT TEST: 02 June 2014 09:13:57 PASSED
MOT TEST: 02 June 2014 09:13:57 PASSED

This test (617003754155) was completed on the 02 June 2014 09:13:57 and PASSED the requirements for a valid MOT with 0 comments.

This test (617003754155) was completed on the 02 June 2014 09:13:57 and PASSED the requirements for a valid MOT with 0 comments.

Recorded mileage: 72,180

Recorded mileage: 72,180


MOT TEST: 04 June 2013 09:19:35 PASSED
MOT TEST: 04 June 2013 09:19:35 PASSED

This test (429585253106) was completed on the 04 June 2013 09:19:35 and PASSED the requirements for a valid MOT with 1 comments.

This test (429585253106) was completed on the 04 June 2013 09:19:35 and PASSED the requirements for a valid MOT with 1 comments.

Recorded mileage: 68,599

Recorded mileage: 68,599


ADVISORY


MOT TEST: 04 June 2013 09:19:35 FAILED
MOT TEST: 04 June 2013 09:19:35 FAILED

This test (208755553444) was completed on the 04 June 2013 09:19:35 and FAILED the requirements for a valid MOT with 2 comments.

This test (208755553444) was completed on the 04 June 2013 09:19:35 and FAILED the requirements for a valid MOT with 2 comments.

Recorded mileage: 68,599

Recorded mileage: 68,599


ADVISORY

PASS WITH RECTIFICATION


MOT TEST: 14 June 2012 14:07:04 PASSED
MOT TEST: 14 June 2012 14:07:04 PASSED

This test (757896162188) was completed on the 14 June 2012 14:07:04 and PASSED the requirements for a valid MOT with 0 comments.

This test (757896162188) was completed on the 14 June 2012 14:07:04 and PASSED the requirements for a valid MOT with 0 comments.

Recorded mileage: 65,978

Recorded mileage: 65,978


MOT TEST: 07 June 2012 09:19:15 FAILED
MOT TEST: 07 June 2012 09:19:15 FAILED

This test (358349352185) was completed on the 07 June 2012 09:19:15 and FAILED the requirements for a valid MOT with 4 comments.

This test (358349352185) was completed on the 07 June 2012 09:19:15 and FAILED the requirements for a valid MOT with 4 comments.

Recorded mileage: 65,966

Recorded mileage: 65,966


FAIL


MOT TEST: 27 May 2011 11:33:20 PASSED
MOT TEST: 27 May 2011 11:33:20 PASSED

This test (407747341133) was completed on the 27 May 2011 11:33:20 and PASSED the requirements for a valid MOT with 3 comments.

This test (407747341133) was completed on the 27 May 2011 11:33:20 and PASSED the requirements for a valid MOT with 3 comments.

Recorded mileage: 62,395

Recorded mileage: 62,395


ADVISORY


MOT TEST: 07 June 2010 16:39:44 PASSED
MOT TEST: 07 June 2010 16:39:44 PASSED

This test (683378250192) was completed on the 07 June 2010 16:39:44 and PASSED the requirements for a valid MOT with 2 comments.

This test (683378250192) was completed on the 07 June 2010 16:39:44 and PASSED the requirements for a valid MOT with 2 comments.

Recorded mileage: 57,612

Recorded mileage: 57,612


USER ENTERED