JFK 531H


JFK531H is registered to a Maroon 1970, Morris Minor 1000 with a Petrol engine. It Failed its most recent MOT Test on the 06 May 2010

17 unique faults (19 Total) reported in its MOT History (9 Tests).

1 common/recurring faults.

56% (5) MOT Pass Rate and a 44% (4) MOT Failure Rate.

97,780 recorded miles.

JFK 531H


JFK531H is registered to a Maroon 1970, Morris Minor 1000 with a Petrol engine. It Failed its most recent MOT Test on the 06 May 2010

17 unique faults (19 Total) reported in its MOT History (9 Tests).

1 common/recurring faults.

56% (5) MOT Pass Rate and a 44% (4) MOT Failure Rate.

97,780 recorded miles.

MOT PASS/Failure rate for JFK 531H

all MOT test results for JFK 531H represented as a percentage
MOT PASS/Failure rate for JFK 531H
all MOT test results for JFK 531H represented as a percentage

PERCENTAGE OF VEHICLE FAULTS WITH JFK 531H

ALL REPORTED FAULTS, DISPLAYED BY PERCENTAGE OF OCCURRENCE DURING ALL MOT TESTS
PERCENTAGE OF VEHICLE FAULTS WITH JFK 531H
ALL REPORTED FAULTS, DISPLAYED BY PERCENTAGE OF OCCURRENCE DURING ALL MOT TESTS
FAIL

PASS WITH RECTIFICATION

JFK 531H annual Faults by type

ALL REPORTED FAULTS, DISPLAYED over time and categorised by type
JFK 531H annual Faults by type
ALL REPORTED FAULTS, DISPLAYED over time and categorised by type

ALL JFK 531H Failure Faults [17]

ALL Failure faults, ORDERED by OCCURRENCE DURING JFK 531H's MOT HISTORY
ALL JFK 531H Failure Faults [17]
ALL Failure faults, ORDERED by OCCURRENCE DURING JFK 531H's MOT HISTORY
Fail Faults | source www.vehiclestats.co.uk
Fault Fault Test Date Test Date/Time Reference MOT Test Reference
3 Parking brake: efficiency below requirements (3.7.b.7) Parking brake: efficiency below requirements (3.7.b.7) 11 May 2009 [13:41] 11/05/2009 09 April 2009 [09:51] 09/04/2009 22 April 2008 [12:25] 22/04/2008 361011039196 361011039196 151569999444 151569999444 291743618407 291743618407
1 Nearside rear rear brake recording little or no effort (3.7.b.5a) Nearside rear rear brake recording little or no effort (3.7.b.5a) 11 May 2009 [13:41] 11/05/2009 361011039196 361011039196
1 Nearside vehicle structure has excessive corrosion, seriously affecting its strength within 30cm of the body mountings (6.1.b.2) Nearside vehicle structure has excessive corrosion, seriously affecting its strength within 30cm of the body mountings (6.1.b.2) 09 April 2009 [09:51] 09/04/2009 151569999444 151569999444
1 Offside vehicle structure has excessive corrosion, seriously affecting its strength within 30cm of the body mountings (6.1.b.2) Offside vehicle structure has excessive corrosion, seriously affecting its strength within 30cm of the body mountings (6.1.b.2) 09 April 2009 [09:51] 09/04/2009 151569999444 151569999444
1 Rear vehicle structure has excessive corrosion, seriously affecting its strength within 30cm of the body mountings (6.1.b.2) Rear vehicle structure has excessive corrosion, seriously affecting its strength within 30cm of the body mountings (6.1.b.2) 09 April 2009 [09:51] 09/04/2009 151569999444 151569999444
1 Offside rear shock absorber has negligible damping effect (2.7.5) Offside rear shock absorber has negligible damping effect (2.7.5) 09 April 2009 [09:51] 09/04/2009 151569999444 151569999444
1 Front brake application uneven (3.7.b.2) Front brake application uneven (3.7.b.2) 09 April 2009 [09:51] 09/04/2009 151569999444 151569999444
1 Nearside front parking brake recording little or no effort (3.7.b.6a) Nearside front parking brake recording little or no effort (3.7.b.6a) 09 April 2009 [09:51] 09/04/2009 151569999444 151569999444
1 Offside front brake binding (3.7.b.1) Offside front brake binding (3.7.b.1) 09 April 2009 [09:51] 09/04/2009 151569999444 151569999444
1 Nearside rear suspension spring mounting prescribed area is excessively corroded (2.4.a.3) Nearside rear suspension spring mounting prescribed area is excessively corroded (2.4.a.3) 09 April 2009 [09:51] 09/04/2009 151569999444 151569999444
1 Offside rear suspension spring mounting prescribed area is excessively corroded (2.4.a.3) Offside rear suspension spring mounting prescribed area is excessively corroded (2.4.a.3) 09 April 2009 [09:51] 09/04/2009 151569999444 151569999444
1 Brakes imbalanced across an axle (3.7.b.5b) Brakes imbalanced across an axle (3.7.b.5b) 09 April 2009 [09:51] 09/04/2009 151569999444 151569999444
1 Brake pedal spongy (3.3.b.1b) Brake pedal spongy (3.3.b.1b) 22 April 2008 [12:25] 22/04/2008 291743618407 291743618407
1 Offside front brake application uneven (3.7.b.2) Offside front brake application uneven (3.7.b.2) 22 April 2008 [12:25] 22/04/2008 291743618407 291743618407
1 Nearside rear parking brake recording little or no effort (3.7.b.6a) Nearside rear parking brake recording little or no effort (3.7.b.6a) 22 April 2008 [12:25] 22/04/2008 291743618407 291743618407

ALL JFK 531H Pass With Rectification Faults [2]

ALL Pass With Rectification faults, ORDERED by OCCURRENCE DURING JFK 531H's MOT HISTORY
ALL JFK 531H Pass With Rectification Faults [2]
ALL Pass With Rectification faults, ORDERED by OCCURRENCE DURING JFK 531H's MOT HISTORY
Pass With Rectification Faults | source www.vehiclestats.co.uk
Fault Fault Test Date Test Date/Time Reference MOT Test Reference
1 Nearside front position lamp(s) not working (1.1.a.3b) Nearside front position lamp(s) not working (1.1.a.3b) 27 April 2006 [14:03] 27/04/2006 362977416106 362977416106
1 Offside stop lamp not working (1.2.1b) Offside stop lamp not working (1.2.1b) 27 April 2006 [14:03] 27/04/2006 362977416106 362977416106

MOT TEST: 06 May 2010 09:34:55 PASSED
MOT TEST: 06 May 2010 09:34:55 PASSED

This test (111906620134) was completed on the 06 May 2010 09:34:55 and PASSED the requirements for a valid MOT with 0 comments.

This test (111906620134) was completed on the 06 May 2010 09:34:55 and PASSED the requirements for a valid MOT with 0 comments.

Recorded mileage: 97,780

Recorded mileage: 97,780


MOT TEST: 11 May 2009 14:42:10 PASSED
MOT TEST: 11 May 2009 14:42:10 PASSED

This test (200661639490) was completed on the 11 May 2009 14:42:10 and PASSED the requirements for a valid MOT with 0 comments.

This test (200661639490) was completed on the 11 May 2009 14:42:10 and PASSED the requirements for a valid MOT with 0 comments.

Recorded mileage: 95,375

Recorded mileage: 95,375


MOT TEST: 11 May 2009 13:41:33 FAILED
MOT TEST: 11 May 2009 13:41:33 FAILED

This test (361011039196) was completed on the 11 May 2009 13:41:33 and FAILED the requirements for a valid MOT with 2 comments.

This test (361011039196) was completed on the 11 May 2009 13:41:33 and FAILED the requirements for a valid MOT with 2 comments.

Recorded mileage: 95,375

Recorded mileage: 95,375


FAIL


MOT TEST: 09 April 2009 09:51:34 FAILED
MOT TEST: 09 April 2009 09:51:34 FAILED

This test (151569999444) was completed on the 09 April 2009 09:51:34 and FAILED the requirements for a valid MOT with 11 comments.

This test (151569999444) was completed on the 09 April 2009 09:51:34 and FAILED the requirements for a valid MOT with 11 comments.

Recorded mileage: 95,336

Recorded mileage: 95,336


FAIL


MOT TEST: 25 April 2008 15:50:04 PASSED
MOT TEST: 25 April 2008 15:50:04 PASSED

This test (612566618151) was completed on the 25 April 2008 15:50:04 and PASSED the requirements for a valid MOT with 0 comments.

This test (612566618151) was completed on the 25 April 2008 15:50:04 and PASSED the requirements for a valid MOT with 0 comments.

Recorded mileage: 94,236

Recorded mileage: 94,236


MOT TEST: 22 April 2008 12:25:21 FAILED
MOT TEST: 22 April 2008 12:25:21 FAILED

This test (291743618407) was completed on the 22 April 2008 12:25:21 and FAILED the requirements for a valid MOT with 4 comments.

This test (291743618407) was completed on the 22 April 2008 12:25:21 and FAILED the requirements for a valid MOT with 4 comments.

Recorded mileage: 94,236

Recorded mileage: 94,236


FAIL


MOT TEST: 26 April 2007 17:38:14 PASSED
MOT TEST: 26 April 2007 17:38:14 PASSED

This test (890816817114) was completed on the 26 April 2007 17:38:14 and PASSED the requirements for a valid MOT with 0 comments.

This test (890816817114) was completed on the 26 April 2007 17:38:14 and PASSED the requirements for a valid MOT with 0 comments.

Recorded mileage: 94,138

Recorded mileage: 94,138


MOT TEST: 27 April 2006 14:03:33 PASSED
MOT TEST: 27 April 2006 14:03:33 PASSED

This test (122887216144) was completed on the 27 April 2006 14:03:33 and PASSED the requirements for a valid MOT with 0 comments.

This test (122887216144) was completed on the 27 April 2006 14:03:33 and PASSED the requirements for a valid MOT with 0 comments.

Recorded mileage: 94,040

Recorded mileage: 94,040


MOT TEST: 27 April 2006 14:03:33 FAILED
MOT TEST: 27 April 2006 14:03:33 FAILED

This test (362977416106) was completed on the 27 April 2006 14:03:33 and FAILED the requirements for a valid MOT with 2 comments.

This test (362977416106) was completed on the 27 April 2006 14:03:33 and FAILED the requirements for a valid MOT with 2 comments.

Recorded mileage: 94,040

Recorded mileage: 94,040


PASS WITH RECTIFICATION