JFK 63H


JFK63H is registered to a Green 1970, Morris Minor 1000 with a Petrol engine. It Failed its most recent MOT Test on the 12 September 2017

47 unique faults (57 Total) reported in its MOT History (15 Tests).

10 common/recurring faults, the most frequent (2 times) is: Windscreen washer provides insufficient washer liquid (8.2.3).

60% (9) MOT Pass Rate and a 40% (6) MOT Failure Rate.

74,239 recorded miles.

JFK 63H


JFK63H is registered to a Green 1970, Morris Minor 1000 with a Petrol engine. It Failed its most recent MOT Test on the 12 September 2017

47 unique faults (57 Total) reported in its MOT History (15 Tests).

10 common/recurring faults, the most frequent (2 times) is: Windscreen washer provides insufficient washer liquid (8.2.3).

60% (9) MOT Pass Rate and a 40% (6) MOT Failure Rate.

74,239 recorded miles.

MOT PASS/Failure rate for JFK 63H

all MOT test results for JFK 63H represented as a percentage
MOT PASS/Failure rate for JFK 63H
all MOT test results for JFK 63H represented as a percentage

PERCENTAGE OF VEHICLE FAULTS WITH JFK 63H

ALL REPORTED FAULTS, DISPLAYED BY PERCENTAGE OF OCCURRENCE DURING ALL MOT TESTS
PERCENTAGE OF VEHICLE FAULTS WITH JFK 63H
ALL REPORTED FAULTS, DISPLAYED BY PERCENTAGE OF OCCURRENCE DURING ALL MOT TESTS
ADVISORY

FAIL

USER ENTERED

PASS WITH RECTIFICATION

JFK 63H annual Faults by type

ALL REPORTED FAULTS, DISPLAYED over time and categorised by type
JFK 63H annual Faults by type
ALL REPORTED FAULTS, DISPLAYED over time and categorised by type

RECURRING FAULTS WITH JFK 63H

FAULTS THAT HAVE OCCURED MORE THAN ONCE DURING JFK 63H's MOT HISTORY
RECURRING FAULTS WITH JFK 63H
FAULTS THAT HAVE OCCURED MORE THAN ONCE DURING JFK 63H's MOT HISTORY
Fault Fault Test Date Test Date/Time Reference MOT Test Reference
2 Windscreen washer provides insufficient washer liquid (8.2.3) Windscreen washer provides insufficient washer liquid (8.2.3) 11 September 2017 [08:14] 11/09/2017 12 August 2011 [15:49] 12/08/2011 707393092709 707393092709 977784921244 977784921244
2 Brake pedal has insufficient reserve movement (3.3.a.5) Brake pedal has insufficient reserve movement (3.3.a.5) 11 September 2017 [08:14] 11/09/2017 24 August 2016 [09:04] 24/08/2016 707393092709 707393092709 809862044690 809862044690
2 Service brake: efficiency below requirements (3.7.b.7) Service brake: efficiency below requirements (3.7.b.7) 11 September 2017 [08:14] 11/09/2017 21 August 2013 [10:06] 21/08/2013 707393092709 707393092709 999023933210 999023933210
2 Centre exhaust has a minor leak of exhaust gases (7.1.2) Centre exhaust has a minor leak of exhaust gases (7.1.2) 05 September 2016 [13:41] 05/09/2016 24 August 2016 [09:04] 24/08/2016 804630952814 804630952814 809862044690 809862044690
2 Rear exhaust has a minor leak of exhaust gases (7.1.2) Rear exhaust has a minor leak of exhaust gases (7.1.2) 02 September 2015 [11:30] 02/09/2015 26 August 2015 [09:12] 26/08/2015 355575145459 355575145459 177088235209 177088235209
2 Steering wheel retaining device insecure (2.1.6) Steering wheel retaining device insecure (2.1.6) 26 August 2015 [09:12] 26/08/2015 12 August 2011 [15:49] 12/08/2011 177088235209 177088235209 977784921244 977784921244
2 Nearside steering rack gaiter split (2.2.d.2d) Nearside steering rack gaiter split (2.2.d.2d) 26 August 2015 [09:12] 26/08/2015 21 August 2013 [10:06] 21/08/2013 177088235209 177088235209 999023933210 999023933210
2 Offside front wheel bearing has slight play (2.5.a.3c) Offside front wheel bearing has slight play (2.5.a.3c) 30 August 2013 [15:10] 30/08/2013 21 August 2013 [10:06] 21/08/2013 776402043292 776402043292 999023933210 999023933210
2 Brakes imbalanced requirements only just met. It would appear that the braking system requires adjustment or repair. (3.7.b.5b) Brakes imbalanced requirements only just met. It would appear that the braking system requires adjustment or repair. (3.7.b.5b) 15 August 2012 [16:39] 15/08/2012 16 August 2010 [09:14] 16/08/2010 607548322278 607548322278 783298020205 783298020205
2 Brake pedal reserve travel minimal Brake pedal reserve travel minimal 18 August 2010 [14:24] 18/08/2010 16 August 2010 [09:14] 16/08/2010 664350530208 664350530208 783298020205 783298020205

ALL JFK 63H ADVISORIES [13]

ALL ADVISORIES, ORDERED by OCCURRENCE DURING JFK 63H's MOT HISTORY
ALL JFK 63H ADVISORIES [13]
ALL ADVISORIES, ORDERED by OCCURRENCE DURING JFK 63H's MOT HISTORY
Advisory Faults | source www.vehiclestats.co.uk
Fault Fault Test Date Test Date/Time Reference MOT Test Reference
2 Centre exhaust has a minor leak of exhaust gases (7.1.2) Centre exhaust has a minor leak of exhaust gases (7.1.2) 05 September 2016 [13:41] 05/09/2016 24 August 2016 [09:04] 24/08/2016 804630952814 804630952814 809862044690 809862044690
2 Rear exhaust has a minor leak of exhaust gases (7.1.2) Rear exhaust has a minor leak of exhaust gases (7.1.2) 02 September 2015 [11:30] 02/09/2015 26 August 2015 [09:12] 26/08/2015 355575145459 355575145459 177088235209 177088235209
2 Offside front wheel bearing has slight play (2.5.a.3c) Offside front wheel bearing has slight play (2.5.a.3c) 30 August 2013 [15:10] 30/08/2013 21 August 2013 [10:06] 21/08/2013 776402043292 776402043292 999023933210 999023933210
2 Brakes imbalanced requirements only just met. It would appear that the braking system requires adjustment or repair. (3.7.b.5b) Brakes imbalanced requirements only just met. It would appear that the braking system requires adjustment or repair. (3.7.b.5b) 15 August 2012 [16:39] 15/08/2012 16 August 2010 [09:14] 16/08/2010 607548322278 607548322278 783298020205 783298020205
1 Slight play nearside front top trunion Slight play nearside front top trunion 12 September 2017 [10:44] 12/09/2017 171986537489 171986537489
1 Front exhaust has a minor leak of exhaust gases (7.1.2) Front exhaust has a minor leak of exhaust gases (7.1.2) 12 September 2017 [10:44] 12/09/2017 171986537489 171986537489
1 Front brakes imbalanced requirements only just met. It would appear that the braking system requires adjustment or repair. (3.7.b.5b) Front brakes imbalanced requirements only just met. It would appear that the braking system requires adjustment or repair. (3.7.b.5b) 05 September 2016 [13:41] 05/09/2016 804630952814 804630952814
1 Nearside front shock absorber has a slightly reduced damping effect (2.7.5) Nearside front shock absorber has a slightly reduced damping effect (2.7.5) 18 August 2009 [11:21] 18/08/2009 563670639229 563670639229
1 Offside front shock absorber has a slightly reduced damping effect (2.7.5) Offside front shock absorber has a slightly reduced damping effect (2.7.5) 18 August 2009 [11:21] 18/08/2009 563670639229 563670639229

ALL JFK 63H Failure Faults [38]

ALL Failure faults, ORDERED by OCCURRENCE DURING JFK 63H's MOT HISTORY
ALL JFK 63H Failure Faults [38]
ALL Failure faults, ORDERED by OCCURRENCE DURING JFK 63H's MOT HISTORY
Fail Faults | source www.vehiclestats.co.uk
Fault Fault Test Date Test Date/Time Reference MOT Test Reference
2 Brake pedal has insufficient reserve movement (3.3.a.5) Brake pedal has insufficient reserve movement (3.3.a.5) 11 September 2017 [08:14] 11/09/2017 24 August 2016 [09:04] 24/08/2016 707393092709 707393092709 809862044690 809862044690
2 Service brake: efficiency below requirements (3.7.b.7) Service brake: efficiency below requirements (3.7.b.7) 11 September 2017 [08:14] 11/09/2017 21 August 2013 [10:06] 21/08/2013 707393092709 707393092709 999023933210 999023933210
2 Nearside steering rack gaiter split (2.2.d.2d) Nearside steering rack gaiter split (2.2.d.2d) 26 August 2015 [09:12] 26/08/2015 21 August 2013 [10:06] 21/08/2013 177088235209 177088235209 999023933210 999023933210
1 Windscreen washer provides insufficient washer liquid (8.2.3) Windscreen washer provides insufficient washer liquid (8.2.3) 11 September 2017 [08:14] 11/09/2017 707393092709 707393092709
1 Nearside front brake recording little or no effort (3.7.b.5a) Nearside front brake recording little or no effort (3.7.b.5a) 11 September 2017 [08:14] 11/09/2017 707393092709 707393092709
1 Offside front brake recording little or no effort (3.7.b.5a) Offside front brake recording little or no effort (3.7.b.5a) 11 September 2017 [08:14] 11/09/2017 707393092709 707393092709
1 Nearside rear brake recording little or no effort (3.7.b.5a) Nearside rear brake recording little or no effort (3.7.b.5a) 11 September 2017 [08:14] 11/09/2017 707393092709 707393092709
1 Offside rear brake recording little or no effort (3.7.b.5a) Offside rear brake recording little or no effort (3.7.b.5a) 11 September 2017 [08:14] 11/09/2017 707393092709 707393092709
1 Rear brakes imbalanced across an axle axle 2 (3.7.b.5b) Rear brakes imbalanced across an axle axle 2 (3.7.b.5b) 24 August 2016 [09:04] 24/08/2016 809862044690 809862044690
1 Brakes imbalanced across an axle (3.7.b.5b) Brakes imbalanced across an axle (3.7.b.5b) 24 August 2016 [09:04] 24/08/2016 809862044690 809862044690
1 Parking brake lever has no reserve travel (3.1.6b) Parking brake lever has no reserve travel (3.1.6b) 24 August 2016 [09:04] 24/08/2016 809862044690 809862044690
1 Nearside front suspension component mounting prescribed area is excessively corroded wheelarch under bonnet (2.4.a.3) Nearside front suspension component mounting prescribed area is excessively corroded wheelarch under bonnet (2.4.a.3) 24 August 2016 [09:04] 24/08/2016 809862044690 809862044690
1 Offside front suspension component mounting prescribed area is excessively corroded wheelarch under bonnet (2.4.a.3) Offside front suspension component mounting prescribed area is excessively corroded wheelarch under bonnet (2.4.a.3) 24 August 2016 [09:04] 24/08/2016 809862044690 809862044690
1 Offside front suspension component mounting prescribed area is excessively corroded floor by torsion bar (2.4.a.3) Offside front suspension component mounting prescribed area is excessively corroded floor by torsion bar (2.4.a.3) 24 August 2016 [09:04] 24/08/2016 809862044690 809862044690
1 Nearside rear suspension component mounting prescribed area is excessively corroded floor by front spring hangover (2.4.a.3) Nearside rear suspension component mounting prescribed area is excessively corroded floor by front spring hangover (2.4.a.3) 24 August 2016 [09:04] 24/08/2016 809862044690 809862044690
1 Nearside front suspension component mounting prescribed area is excessively corroded flitch (2.4.a.3) Nearside front suspension component mounting prescribed area is excessively corroded flitch (2.4.a.3) 24 August 2016 [09:04] 24/08/2016 809862044690 809862044690
1 Offside front suspension component mounting prescribed area is excessively corroded flitch (2.4.a.3) Offside front suspension component mounting prescribed area is excessively corroded flitch (2.4.a.3) 24 August 2016 [09:04] 24/08/2016 809862044690 809862044690
1 Nearside rear suspension component mounting prescribed area is inadequately repaired floor by rear spring hanger (2.4.a.3) Nearside rear suspension component mounting prescribed area is inadequately repaired floor by rear spring hanger (2.4.a.3) 24 August 2016 [09:04] 24/08/2016 809862044690 809862044690
1 Suspension component mounting prescribed area is inadequately repaired crossmember by offside front torsion bar (2.4.a.3) Suspension component mounting prescribed area is inadequately repaired crossmember by offside front torsion bar (2.4.a.3) 24 August 2016 [09:04] 24/08/2016 809862044690 809862044690
1 Offside front front wheel bearing rough when rotated (2.5.a.2) Offside front front wheel bearing rough when rotated (2.5.a.2) 24 August 2016 [09:04] 24/08/2016 809862044690 809862044690
1 Steering wheel locking device insecure (2.1.6) Steering wheel locking device insecure (2.1.6) 24 August 2016 [09:04] 24/08/2016 809862044690 809862044690
1 Offside steering rack gaiter split (2.2.d.2d) Offside steering rack gaiter split (2.2.d.2d) 24 August 2016 [09:04] 24/08/2016 809862044690 809862044690
1 Steering wheel retaining device insecure (2.1.6) Steering wheel retaining device insecure (2.1.6) 26 August 2015 [09:12] 26/08/2015 177088235209 177088235209
1 Offside front wheel bearing rough when rotated (2.5.a.2) Offside front wheel bearing rough when rotated (2.5.a.2) 26 August 2015 [09:12] 26/08/2015 177088235209 177088235209
1 Offside front suspension ball joint dust cover missing (2.4.g.2) Offside front suspension ball joint dust cover missing (2.4.g.2) 26 August 2015 [09:12] 26/08/2015 177088235209 177088235209
1 Nearside rear registration plate lamp not working (1.1.c.1d) Nearside rear registration plate lamp not working (1.1.c.1d) 21 August 2013 [10:06] 21/08/2013 999023933210 999023933210
1 Offside front headlamp aim too high and too far to the left. (1.8) Offside front headlamp aim too high and too far to the left. (1.8) 21 August 2013 [10:06] 21/08/2013 999023933210 999023933210
1 Nearside front seat belt anchorage prescribed area is excessively corroded (5.2.6) Nearside front seat belt anchorage prescribed area is excessively corroded (5.2.6) 21 August 2013 [10:06] 21/08/2013 999023933210 999023933210
1 Offside front seat belt anchorage prescribed area is excessively corroded (5.2.6) Offside front seat belt anchorage prescribed area is excessively corroded (5.2.6) 21 August 2013 [10:06] 21/08/2013 999023933210 999023933210
1 Front passengers seat insecure (6.2.a.1) Front passengers seat insecure (6.2.a.1) 21 August 2013 [10:06] 21/08/2013 999023933210 999023933210
1 Nearside front wheel bearing rough when rotated (2.5.a.2) Nearside front wheel bearing rough when rotated (2.5.a.2) 16 August 2010 [09:14] 16/08/2010 783298020205 783298020205
1 Offside front lower steering pivot point has excessive play (2.2.b.1g) Offside front lower steering pivot point has excessive play (2.2.b.1g) 16 August 2010 [09:14] 16/08/2010 783298020205 783298020205
1 Nearside rear leaf spring shackle pin excessively loose in its bracket (2.4.b.3a) Nearside rear leaf spring shackle pin excessively loose in its bracket (2.4.b.3a) 16 August 2010 [09:14] 16/08/2010 783298020205 783298020205
1 Offside rear leaf spring shackle pin excessively loose in its bracket (2.4.b.3a) Offside rear leaf spring shackle pin excessively loose in its bracket (2.4.b.3a) 16 August 2010 [09:14] 16/08/2010 783298020205 783298020205
1 Brake pipe inadequately supported (3.6.b.1) Brake pipe inadequately supported (3.6.b.1) 16 August 2010 [09:14] 16/08/2010 783298020205 783298020205

ALL JFK 63H User Entered Faults [4]

ALL User Entered faults, ORDERED by OCCURRENCE DURING JFK 63H's MOT HISTORY
ALL JFK 63H User Entered Faults [4]
ALL User Entered faults, ORDERED by OCCURRENCE DURING JFK 63H's MOT HISTORY
User Entered Faults | source www.vehiclestats.co.uk
Fault Fault Test Date Test Date/Time Reference MOT Test Reference
2 Brake pedal reserve travel minimal Brake pedal reserve travel minimal 18 August 2010 [14:24] 18/08/2010 16 August 2010 [09:14] 16/08/2010 664350530208 664350530208 783298020205 783298020205
1 Slight noise when offside front wheel rotated, no roughnes detected Slight noise when offside front wheel rotated, no roughnes detected 02 September 2015 [11:30] 02/09/2015 355575145459 355575145459
1 Slight play offside front lower trunion Slight play offside front lower trunion 01 September 2014 [11:04] 01/09/2014 596814144279 596814144279

ALL JFK 63H Pass With Rectification Faults [2]

ALL Pass With Rectification faults, ORDERED by OCCURRENCE DURING JFK 63H's MOT HISTORY
ALL JFK 63H Pass With Rectification Faults [2]
ALL Pass With Rectification faults, ORDERED by OCCURRENCE DURING JFK 63H's MOT HISTORY
Pass With Rectification Faults | source www.vehiclestats.co.uk
Fault Fault Test Date Test Date/Time Reference MOT Test Reference
1 Steering wheel retaining device insecure (2.1.6) Steering wheel retaining device insecure (2.1.6) 12 August 2011 [15:49] 12/08/2011 977784921244 977784921244
1 Windscreen washer provides insufficient washer liquid (8.2.3) Windscreen washer provides insufficient washer liquid (8.2.3) 12 August 2011 [15:49] 12/08/2011 977784921244 977784921244

MOT TEST: 12 September 2017 10:44:35 PASSED
MOT TEST: 12 September 2017 10:44:35 PASSED

This test (171986537489) was completed on the 12 September 2017 10:44:35 and PASSED the requirements for a valid MOT with 2 comments.

This test (171986537489) was completed on the 12 September 2017 10:44:35 and PASSED the requirements for a valid MOT with 2 comments.

Recorded mileage: 74,239

Recorded mileage: 74,239


ADVISORY


MOT TEST: 11 September 2017 08:14:43 FAILED
MOT TEST: 11 September 2017 08:14:43 FAILED

This test (707393092709) was completed on the 11 September 2017 08:14:43 and FAILED the requirements for a valid MOT with 7 comments.

This test (707393092709) was completed on the 11 September 2017 08:14:43 and FAILED the requirements for a valid MOT with 7 comments.

Recorded mileage: 74,231

Recorded mileage: 74,231


FAIL


MOT TEST: 05 September 2016 13:41:39 PASSED
MOT TEST: 05 September 2016 13:41:39 PASSED

This test (804630952814) was completed on the 05 September 2016 13:41:39 and PASSED the requirements for a valid MOT with 2 comments.

This test (804630952814) was completed on the 05 September 2016 13:41:39 and PASSED the requirements for a valid MOT with 2 comments.

Recorded mileage: 73,925

Recorded mileage: 73,925


ADVISORY


MOT TEST: 24 August 2016 09:04:31 FAILED
MOT TEST: 24 August 2016 09:04:31 FAILED

This test (809862044690) was completed on the 24 August 2016 09:04:31 and FAILED the requirements for a valid MOT with 16 comments.

This test (809862044690) was completed on the 24 August 2016 09:04:31 and FAILED the requirements for a valid MOT with 16 comments.

Recorded mileage: 73,896

Recorded mileage: 73,896


ADVISORY

FAIL


MOT TEST: 02 September 2015 11:30:29 PASSED
MOT TEST: 02 September 2015 11:30:29 PASSED

This test (355575145459) was completed on the 02 September 2015 11:30:29 and PASSED the requirements for a valid MOT with 2 comments.

This test (355575145459) was completed on the 02 September 2015 11:30:29 and PASSED the requirements for a valid MOT with 2 comments.

Recorded mileage: 73,090

Recorded mileage: 73,090


ADVISORY

USER ENTERED


MOT TEST: 26 August 2015 09:12:42 FAILED
MOT TEST: 26 August 2015 09:12:42 FAILED

This test (177088235209) was completed on the 26 August 2015 09:12:42 and FAILED the requirements for a valid MOT with 5 comments.

This test (177088235209) was completed on the 26 August 2015 09:12:42 and FAILED the requirements for a valid MOT with 5 comments.

Recorded mileage: 73,082

Recorded mileage: 73,082


ADVISORY

FAIL


MOT TEST: 01 September 2014 11:04:53 PASSED
MOT TEST: 01 September 2014 11:04:53 PASSED

This test (596814144279) was completed on the 01 September 2014 11:04:53 and PASSED the requirements for a valid MOT with 1 comments.

This test (596814144279) was completed on the 01 September 2014 11:04:53 and PASSED the requirements for a valid MOT with 1 comments.

Recorded mileage: 72,545

Recorded mileage: 72,545


USER ENTERED


MOT TEST: 30 August 2013 15:10:32 PASSED
MOT TEST: 30 August 2013 15:10:32 PASSED

This test (776402043292) was completed on the 30 August 2013 15:10:32 and PASSED the requirements for a valid MOT with 1 comments.

This test (776402043292) was completed on the 30 August 2013 15:10:32 and PASSED the requirements for a valid MOT with 1 comments.

Recorded mileage: 71,913

Recorded mileage: 71,913


ADVISORY


MOT TEST: 21 August 2013 10:06:45 FAILED
MOT TEST: 21 August 2013 10:06:45 FAILED

This test (999023933210) was completed on the 21 August 2013 10:06:45 and FAILED the requirements for a valid MOT with 8 comments.

This test (999023933210) was completed on the 21 August 2013 10:06:45 and FAILED the requirements for a valid MOT with 8 comments.

Recorded mileage: 71,905

Recorded mileage: 71,905


ADVISORY

FAIL


MOT TEST: 15 August 2012 16:39:40 PASSED
MOT TEST: 15 August 2012 16:39:40 PASSED

This test (607548322278) was completed on the 15 August 2012 16:39:40 and PASSED the requirements for a valid MOT with 1 comments.

This test (607548322278) was completed on the 15 August 2012 16:39:40 and PASSED the requirements for a valid MOT with 1 comments.

Recorded mileage: 71,112

Recorded mileage: 71,112


ADVISORY


MOT TEST: 12 August 2011 15:49:35 PASSED
MOT TEST: 12 August 2011 15:49:35 PASSED

This test (316484921462) was completed on the 12 August 2011 15:49:35 and PASSED the requirements for a valid MOT with 0 comments.

This test (316484921462) was completed on the 12 August 2011 15:49:35 and PASSED the requirements for a valid MOT with 0 comments.

Recorded mileage: 70,482

Recorded mileage: 70,482


MOT TEST: 12 August 2011 15:49:35 FAILED
MOT TEST: 12 August 2011 15:49:35 FAILED

This test (977784921244) was completed on the 12 August 2011 15:49:35 and FAILED the requirements for a valid MOT with 2 comments.

This test (977784921244) was completed on the 12 August 2011 15:49:35 and FAILED the requirements for a valid MOT with 2 comments.

Recorded mileage: 70,482

Recorded mileage: 70,482


PASS WITH RECTIFICATION


MOT TEST: 18 August 2010 14:24:27 PASSED
MOT TEST: 18 August 2010 14:24:27 PASSED

This test (664350530208) was completed on the 18 August 2010 14:24:27 and PASSED the requirements for a valid MOT with 1 comments.

This test (664350530208) was completed on the 18 August 2010 14:24:27 and PASSED the requirements for a valid MOT with 1 comments.

Recorded mileage: 69,628

Recorded mileage: 69,628


USER ENTERED


MOT TEST: 16 August 2010 09:14:55 FAILED
MOT TEST: 16 August 2010 09:14:55 FAILED

This test (783298020205) was completed on the 16 August 2010 09:14:55 and FAILED the requirements for a valid MOT with 7 comments.

This test (783298020205) was completed on the 16 August 2010 09:14:55 and FAILED the requirements for a valid MOT with 7 comments.

Recorded mileage: 69,575

Recorded mileage: 69,575


ADVISORY

FAIL

USER ENTERED


MOT TEST: 18 August 2009 11:21:58 PASSED
MOT TEST: 18 August 2009 11:21:58 PASSED

This test (563670639229) was completed on the 18 August 2009 11:21:58 and PASSED the requirements for a valid MOT with 2 comments.

This test (563670639229) was completed on the 18 August 2009 11:21:58 and PASSED the requirements for a valid MOT with 2 comments.

Recorded mileage: 68,372

Recorded mileage: 68,372


ADVISORY