JFK 727C


JFK727C is registered to a Green 1965, Morris Minor traveller with a Petrol engine. It Passed its most recent MOT Test on the 19 May 2018

20 unique faults (21 Total) reported in its MOT History (17 Tests).

1 common/recurring faults.

76% (13) MOT Pass Rate and a 24% (4) MOT Failure Rate.

41,705 recorded miles.

JFK 727C


JFK727C is registered to a Green 1965, Morris Minor traveller with a Petrol engine. It Passed its most recent MOT Test on the 19 May 2018

20 unique faults (21 Total) reported in its MOT History (17 Tests).

1 common/recurring faults.

76% (13) MOT Pass Rate and a 24% (4) MOT Failure Rate.

41,705 recorded miles.

MOT PASS/Failure rate for JFK 727C

all MOT test results for JFK 727C represented as a percentage
MOT PASS/Failure rate for JFK 727C
all MOT test results for JFK 727C represented as a percentage

PERCENTAGE OF VEHICLE FAULTS WITH JFK 727C

ALL REPORTED FAULTS, DISPLAYED BY PERCENTAGE OF OCCURRENCE DURING ALL MOT TESTS
PERCENTAGE OF VEHICLE FAULTS WITH JFK 727C
ALL REPORTED FAULTS, DISPLAYED BY PERCENTAGE OF OCCURRENCE DURING ALL MOT TESTS
FAIL

USER ENTERED

JFK 727C annual Faults by type

ALL REPORTED FAULTS, DISPLAYED over time and categorised by type
JFK 727C annual Faults by type
ALL REPORTED FAULTS, DISPLAYED over time and categorised by type

ALL JFK 727C Failure Faults [19]

ALL Failure faults, ORDERED by OCCURRENCE DURING JFK 727C's MOT HISTORY
ALL JFK 727C Failure Faults [19]
ALL Failure faults, ORDERED by OCCURRENCE DURING JFK 727C's MOT HISTORY
Fail Faults | source www.vehiclestats.co.uk
Fault Fault Test Date Test Date/Time Reference MOT Test Reference
2 Parking brake: efficiency below requirements (3.7.b.7) Parking brake: efficiency below requirements (3.7.b.7) 02 May 2013 [10:13] 02/05/2013 07 April 2006 [12:38] 07/04/2006 398072523113 398072523113 512967896036 512967896036
1 Front brake pipe inadequately clipped (3.6.b.1) Front brake pipe inadequately clipped (3.6.b.1) 23 April 2014 [10:51] 23/04/2014 875903114141 875903114141
1 Front brake pipe inadequately supported (3.6.b.1) Front brake pipe inadequately supported (3.6.b.1) 23 April 2014 [10:51] 23/04/2014 875903114141 875903114141
1 Nearside front position lamp(s) not working (1.1.a.3b) Nearside front position lamp(s) not working (1.1.a.3b) 02 May 2013 [10:13] 02/05/2013 398072523113 398072523113
1 Offside registration plate lamp not working (1.1.c.1d) Offside registration plate lamp not working (1.1.c.1d) 02 May 2013 [10:13] 02/05/2013 398072523113 398072523113
1 Nearside rear brake binding (3.7.b.1) Nearside rear brake binding (3.7.b.1) 02 May 2013 [10:13] 02/05/2013 398072523113 398072523113
1 Offside rear brake binding (3.7.b.1) Offside rear brake binding (3.7.b.1) 02 May 2013 [10:13] 02/05/2013 398072523113 398072523113
1 Offside headlamp aim too high and too far to the right. (1.8) Offside headlamp aim too high and too far to the right. (1.8) 19 May 2011 [10:31] 19/05/2011 567329431130 567329431130
1 Offside rear seat belt locking mechanism does not secure or release (5.2.5a) Offside rear seat belt locking mechanism does not secure or release (5.2.5a) 19 May 2011 [10:31] 19/05/2011 567329431130 567329431130
1 Nearside rear shock absorber insecure (2.7.2b) Nearside rear shock absorber insecure (2.7.2b) 19 May 2011 [10:31] 19/05/2011 567329431130 567329431130
1 Nearside front suspension arm insecure (2.4.g.1) Nearside front suspension arm insecure (2.4.g.1) 19 May 2011 [10:31] 19/05/2011 567329431130 567329431130
1 Offside rear rear brake binding (3.7.b.1) Offside rear rear brake binding (3.7.b.1) 19 May 2011 [10:31] 19/05/2011 567329431130 567329431130
1 Brake hydraulic reservoir fluid level below minimum level (3.6.g.1b) Brake hydraulic reservoir fluid level below minimum level (3.6.g.1b) 19 May 2011 [10:31] 19/05/2011 567329431130 567329431130
1 Nearside windscreen wiper blade deteriorated (8.2.2) Nearside windscreen wiper blade deteriorated (8.2.2) 07 April 2006 [12:38] 07/04/2006 512967896036 512967896036
1 Offside windscreen wiper blade deteriorated (8.2.2) Offside windscreen wiper blade deteriorated (8.2.2) 07 April 2006 [12:38] 07/04/2006 512967896036 512967896036
1 Offside rear braking system leaking (3.6.a.1) Offside rear braking system leaking (3.6.a.1) 07 April 2006 [12:38] 07/04/2006 512967896036 512967896036
1 Nearside rear brake recording little or no effort (3.7.b.5a) Nearside rear brake recording little or no effort (3.7.b.5a) 07 April 2006 [12:38] 07/04/2006 512967896036 512967896036
1 Nearside rear parking brake recording little or no effort (3.7.b.6a) Nearside rear parking brake recording little or no effort (3.7.b.6a) 07 April 2006 [12:38] 07/04/2006 512967896036 512967896036

ALL JFK 727C User Entered Faults [2]

ALL User Entered faults, ORDERED by OCCURRENCE DURING JFK 727C's MOT HISTORY
ALL JFK 727C User Entered Faults [2]
ALL User Entered faults, ORDERED by OCCURRENCE DURING JFK 727C's MOT HISTORY
User Entered Faults | source www.vehiclestats.co.uk
Fault Fault Test Date Test Date/Time Reference MOT Test Reference
1 Front to rear wiring harness has protective covering missing on some sections leaving the cables rubbing on the metal clips Front to rear wiring harness has protective covering missing on some sections leaving the cables rubbing on the metal clips 23 April 2012 [10:09] 23/04/2012 646104812141 646104812141
1 Wiring ioom under rear of car has worn through the braid the cores are now rubbing on the metal clip Wiring ioom under rear of car has worn through the braid the cores are now rubbing on the metal clip 01 July 2010 [11:10] 01/07/2010 422172380153 422172380153

MOT TEST: 19 May 2018 09:29:11 PASSED
MOT TEST: 19 May 2018 09:29:11 PASSED

This test (130672851670) was completed on the 19 May 2018 09:29:11 and PASSED the requirements for a valid MOT with 0 comments.

This test (130672851670) was completed on the 19 May 2018 09:29:11 and PASSED the requirements for a valid MOT with 0 comments.

Recorded mileage: 41,705

Recorded mileage: 41,705


MOT TEST: 11 May 2017 12:08:39 PASSED
MOT TEST: 11 May 2017 12:08:39 PASSED

This test (541606275796) was completed on the 11 May 2017 12:08:39 and PASSED the requirements for a valid MOT with 0 comments.

This test (541606275796) was completed on the 11 May 2017 12:08:39 and PASSED the requirements for a valid MOT with 0 comments.

Recorded mileage: 41,174

Recorded mileage: 41,174


MOT TEST: 20 May 2016 15:21:06 PASSED
MOT TEST: 20 May 2016 15:21:06 PASSED

This test (940331882798) was completed on the 20 May 2016 15:21:06 and PASSED the requirements for a valid MOT with 0 comments.

This test (940331882798) was completed on the 20 May 2016 15:21:06 and PASSED the requirements for a valid MOT with 0 comments.

Recorded mileage: 40,668

Recorded mileage: 40,668


MOT TEST: 21 May 2015 15:56:55 PASSED
MOT TEST: 21 May 2015 15:56:55 PASSED

This test (618221445193) was completed on the 21 May 2015 15:56:55 and PASSED the requirements for a valid MOT with 0 comments.

This test (618221445193) was completed on the 21 May 2015 15:56:55 and PASSED the requirements for a valid MOT with 0 comments.

Recorded mileage: 40,050

Recorded mileage: 40,050


MOT TEST: 24 April 2014 08:54:39 PASSED
MOT TEST: 24 April 2014 08:54:39 PASSED

This test (869274014151) was completed on the 24 April 2014 08:54:39 and PASSED the requirements for a valid MOT with 0 comments.

This test (869274014151) was completed on the 24 April 2014 08:54:39 and PASSED the requirements for a valid MOT with 0 comments.

Recorded mileage: 39,379

Recorded mileage: 39,379


MOT TEST: 23 April 2014 10:51:32 FAILED
MOT TEST: 23 April 2014 10:51:32 FAILED

This test (875903114141) was completed on the 23 April 2014 10:51:32 and FAILED the requirements for a valid MOT with 2 comments.

This test (875903114141) was completed on the 23 April 2014 10:51:32 and FAILED the requirements for a valid MOT with 2 comments.

Recorded mileage: 0

Recorded mileage: 0


FAIL


MOT TEST: 14 May 2013 12:32:03 PASSED
MOT TEST: 14 May 2013 12:32:03 PASSED

This test (187544033124) was completed on the 14 May 2013 12:32:03 and PASSED the requirements for a valid MOT with 0 comments.

This test (187544033124) was completed on the 14 May 2013 12:32:03 and PASSED the requirements for a valid MOT with 0 comments.

Recorded mileage: 38,707

Recorded mileage: 38,707


MOT TEST: 02 May 2013 10:13:51 FAILED
MOT TEST: 02 May 2013 10:13:51 FAILED

This test (398072523113) was completed on the 02 May 2013 10:13:51 and FAILED the requirements for a valid MOT with 5 comments.

This test (398072523113) was completed on the 02 May 2013 10:13:51 and FAILED the requirements for a valid MOT with 5 comments.

Recorded mileage: 38,704

Recorded mileage: 38,704


FAIL


MOT TEST: 23 April 2012 10:09:16 PASSED
MOT TEST: 23 April 2012 10:09:16 PASSED

This test (646104812141) was completed on the 23 April 2012 10:09:16 and PASSED the requirements for a valid MOT with 1 comments.

This test (646104812141) was completed on the 23 April 2012 10:09:16 and PASSED the requirements for a valid MOT with 1 comments.

Recorded mileage: 38,539

Recorded mileage: 38,539


USER ENTERED


MOT TEST: 20 May 2011 10:38:30 PASSED
MOT TEST: 20 May 2011 10:38:30 PASSED

This test (295170941152) was completed on the 20 May 2011 10:38:30 and PASSED the requirements for a valid MOT with 0 comments.

This test (295170941152) was completed on the 20 May 2011 10:38:30 and PASSED the requirements for a valid MOT with 0 comments.

Recorded mileage: 37,974

Recorded mileage: 37,974


MOT TEST: 19 May 2011 10:31:28 FAILED
MOT TEST: 19 May 2011 10:31:28 FAILED

This test (567329431130) was completed on the 19 May 2011 10:31:28 and FAILED the requirements for a valid MOT with 6 comments.

This test (567329431130) was completed on the 19 May 2011 10:31:28 and FAILED the requirements for a valid MOT with 6 comments.

Recorded mileage: 37,974

Recorded mileage: 37,974


FAIL


MOT TEST: 01 July 2010 11:10:05 PASSED
MOT TEST: 01 July 2010 11:10:05 PASSED

This test (422172380153) was completed on the 01 July 2010 11:10:05 and PASSED the requirements for a valid MOT with 1 comments.

This test (422172380153) was completed on the 01 July 2010 11:10:05 and PASSED the requirements for a valid MOT with 1 comments.

Recorded mileage: 37,814

Recorded mileage: 37,814


USER ENTERED


MOT TEST: 20 March 2009 14:04:45 PASSED
MOT TEST: 20 March 2009 14:04:45 PASSED

This test (642009979011) was completed on the 20 March 2009 14:04:45 and PASSED the requirements for a valid MOT with 0 comments.

This test (642009979011) was completed on the 20 March 2009 14:04:45 and PASSED the requirements for a valid MOT with 0 comments.

Recorded mileage: 37,058

Recorded mileage: 37,058


MOT TEST: 11 April 2008 12:29:01 PASSED
MOT TEST: 11 April 2008 12:29:01 PASSED

This test (280032808443) was completed on the 11 April 2008 12:29:01 and PASSED the requirements for a valid MOT with 0 comments.

This test (280032808443) was completed on the 11 April 2008 12:29:01 and PASSED the requirements for a valid MOT with 0 comments.

Recorded mileage: 36,539

Recorded mileage: 36,539


MOT TEST: 06 April 2007 09:34:26 PASSED
MOT TEST: 06 April 2007 09:34:26 PASSED

This test (172516497491) was completed on the 06 April 2007 09:34:26 and PASSED the requirements for a valid MOT with 0 comments.

This test (172516497491) was completed on the 06 April 2007 09:34:26 and PASSED the requirements for a valid MOT with 0 comments.

Recorded mileage: 35,810

Recorded mileage: 35,810


MOT TEST: 07 April 2006 16:12:47 PASSED
MOT TEST: 07 April 2006 16:12:47 PASSED

This test (993157896069) was completed on the 07 April 2006 16:12:47 and PASSED the requirements for a valid MOT with 0 comments.

This test (993157896069) was completed on the 07 April 2006 16:12:47 and PASSED the requirements for a valid MOT with 0 comments.

Recorded mileage: 35,245

Recorded mileage: 35,245


MOT TEST: 07 April 2006 12:38:14 FAILED
MOT TEST: 07 April 2006 12:38:14 FAILED

This test (512967896036) was completed on the 07 April 2006 12:38:14 and FAILED the requirements for a valid MOT with 6 comments.

This test (512967896036) was completed on the 07 April 2006 12:38:14 and FAILED the requirements for a valid MOT with 6 comments.

Recorded mileage: 35,238

Recorded mileage: 35,238


FAIL