JGG 299D


JGG299D is registered to a Blue 1966, Morris Motorcaravan with a Petrol engine. It Failed its most recent MOT Test on the 09 March 2010

12 unique faults (16 Total) reported in its MOT History (8 Tests).

3 common/recurring faults, the most frequent (3 times) is: Parking brake: efficiency below requirements (3.7.C.1b).

38% (3) MOT Pass Rate and a 62% (5) MOT Failure Rate.

73,385 recorded miles.

JGG 299D


JGG299D is registered to a Blue 1966, Morris Motorcaravan with a Petrol engine. It Failed its most recent MOT Test on the 09 March 2010

12 unique faults (16 Total) reported in its MOT History (8 Tests).

3 common/recurring faults, the most frequent (3 times) is: Parking brake: efficiency below requirements (3.7.C.1b).

38% (3) MOT Pass Rate and a 62% (5) MOT Failure Rate.

73,385 recorded miles.

MOT PASS/Failure rate for JGG 299D

all MOT test results for JGG 299D represented as a percentage
MOT PASS/Failure rate for JGG 299D
all MOT test results for JGG 299D represented as a percentage

PERCENTAGE OF VEHICLE FAULTS WITH JGG 299D

ALL REPORTED FAULTS, DISPLAYED BY PERCENTAGE OF OCCURRENCE DURING ALL MOT TESTS
PERCENTAGE OF VEHICLE FAULTS WITH JGG 299D
ALL REPORTED FAULTS, DISPLAYED BY PERCENTAGE OF OCCURRENCE DURING ALL MOT TESTS
ADVISORY

FAIL

JGG 299D annual Faults by type

ALL REPORTED FAULTS, DISPLAYED over time and categorised by type
JGG 299D annual Faults by type
ALL REPORTED FAULTS, DISPLAYED over time and categorised by type

RECURRING FAULTS WITH JGG 299D

FAULTS THAT HAVE OCCURED MORE THAN ONCE DURING JGG 299D's MOT HISTORY
RECURRING FAULTS WITH JGG 299D
FAULTS THAT HAVE OCCURED MORE THAN ONCE DURING JGG 299D's MOT HISTORY
Fault Fault Test Date Test Date/Time Reference MOT Test Reference
3 Parking brake: efficiency below requirements (3.7.c.1b) Parking brake: efficiency below requirements (3.7.c.1b) 28 July 2008 [15:55] 28/07/2008 28 April 2008 [16:50] 28/04/2008 31 May 2006 [15:16] 31/05/2006 931920418263 931920418263 422679518114 422679518114 593341456147 593341456147
2 Offside front axle king pin has excessive play in pin and/or bush adversely affecting the steering (2.5.a.3a) Offside front axle king pin has excessive play in pin and/or bush adversely affecting the steering (2.5.a.3a) 05 March 2010 [12:14] 05/03/2010 31 May 2006 [15:16] 31/05/2006 130434160439 130434160439 593341456147 593341456147
2 Horn not working (1.6.2a) Horn not working (1.6.2a) 28 July 2008 [15:55] 28/07/2008 28 April 2008 [16:50] 28/04/2008 931920418263 931920418263 422679518114 422679518114

ALL JGG 299D ADVISORIES [1]

ALL ADVISORIES, ORDERED by OCCURRENCE DURING JGG 299D's MOT HISTORY
ALL JGG 299D ADVISORIES [1]
ALL ADVISORIES, ORDERED by OCCURRENCE DURING JGG 299D's MOT HISTORY
Fail Faults | source www.vehiclestats.co.uk
Fault Fault Test Date Test Date/Time Reference MOT Test Reference
1 Parking brake: parking brake efficiency only just met. It would appear that the braking system requires adjustment or repair. (3.7.c.1b) Parking brake: parking brake efficiency only just met. It would appear that the braking system requires adjustment or repair. (3.7.c.1b) 05 March 2010 [12:14] 05/03/2010 130434160439 130434160439

ALL JGG 299D Failure Faults [15]

ALL Failure faults, ORDERED by OCCURRENCE DURING JGG 299D's MOT HISTORY
ALL JGG 299D Failure Faults [15]
ALL Failure faults, ORDERED by OCCURRENCE DURING JGG 299D's MOT HISTORY
Fail Faults | source www.vehiclestats.co.uk
Fault Fault Test Date Test Date/Time Reference MOT Test Reference
3 Parking brake: efficiency below requirements (3.7.c.1b) Parking brake: efficiency below requirements (3.7.c.1b) 28 July 2008 [15:55] 28/07/2008 28 April 2008 [16:50] 28/04/2008 31 May 2006 [15:16] 31/05/2006 931920418263 931920418263 422679518114 422679518114 593341456147 593341456147
2 Offside front axle king pin has excessive play in pin and/or bush adversely affecting the steering (2.5.a.3a) Offside front axle king pin has excessive play in pin and/or bush adversely affecting the steering (2.5.a.3a) 05 March 2010 [12:14] 05/03/2010 31 May 2006 [15:16] 31/05/2006 130434160439 130434160439 593341456147 593341456147
2 Horn not working (1.6.2a) Horn not working (1.6.2a) 28 July 2008 [15:55] 28/07/2008 28 April 2008 [16:50] 28/04/2008 931920418263 931920418263 422679518114 422679518114
1 Nearside front brake binding (3.7.b.1) Nearside front brake binding (3.7.b.1) 05 March 2010 [12:14] 05/03/2010 130434160439 130434160439
1 Offside rear parking brake recording little or no effort (3.7.b.6a) Offside rear parking brake recording little or no effort (3.7.b.6a) 28 July 2008 [15:55] 28/07/2008 931920418263 931920418263
1 Nearside rear position lamp(s) adversely affected by the operation of another lamp (1.1.a.3f) Nearside rear position lamp(s) adversely affected by the operation of another lamp (1.1.a.3f) 28 April 2008 [16:50] 28/04/2008 422679518114 422679518114
1 Rear drag link end ball pin shank loose (2.2.b.1c) Rear drag link end ball pin shank loose (2.2.b.1c) 28 April 2008 [16:50] 28/04/2008 422679518114 422679518114
1 Brake master cylinder leaking hydraulic fluid (3.6.g.1f) Brake master cylinder leaking hydraulic fluid (3.6.g.1f) 28 April 2008 [16:50] 28/04/2008 422679518114 422679518114
1 Offside rear position lamp(s) excessively deteriorated so that it is not visible from a reasonable distance (1.1.a.3d) Offside rear position lamp(s) excessively deteriorated so that it is not visible from a reasonable distance (1.1.a.3d) 02 August 2006 [17:55] 02/08/2006 211924716245 211924716245
1 Nearside stop lamp not working (1.2.1b) Nearside stop lamp not working (1.2.1b) 02 August 2006 [17:55] 02/08/2006 211924716245 211924716245
1 Registration plate lamp not working (1.1.5c) Registration plate lamp not working (1.1.5c) 02 August 2006 [17:55] 02/08/2006 211924716245 211924716245

MOT TEST: 09 March 2010 17:02:35 PASSED
MOT TEST: 09 March 2010 17:02:35 PASSED

This test (480028060004) was completed on the 09 March 2010 17:02:35 and PASSED the requirements for a valid MOT with 0 comments.

This test (480028060004) was completed on the 09 March 2010 17:02:35 and PASSED the requirements for a valid MOT with 0 comments.

Recorded mileage: 73,385

Recorded mileage: 73,385


MOT TEST: 05 March 2010 12:14:13 FAILED
MOT TEST: 05 March 2010 12:14:13 FAILED

This test (130434160439) was completed on the 05 March 2010 12:14:13 and FAILED the requirements for a valid MOT with 3 comments.

This test (130434160439) was completed on the 05 March 2010 12:14:13 and FAILED the requirements for a valid MOT with 3 comments.

Recorded mileage: 73,380

Recorded mileage: 73,380


ADVISORY

FAIL


MOT TEST: 30 July 2008 16:40:39 PASSED
MOT TEST: 30 July 2008 16:40:39 PASSED

This test (334672918469) was completed on the 30 July 2008 16:40:39 and PASSED the requirements for a valid MOT with 0 comments.

This test (334672918469) was completed on the 30 July 2008 16:40:39 and PASSED the requirements for a valid MOT with 0 comments.

Recorded mileage: 72,355

Recorded mileage: 72,355


MOT TEST: 28 July 2008 15:55:55 FAILED
MOT TEST: 28 July 2008 15:55:55 FAILED

This test (931920418263) was completed on the 28 July 2008 15:55:55 and FAILED the requirements for a valid MOT with 3 comments.

This test (931920418263) was completed on the 28 July 2008 15:55:55 and FAILED the requirements for a valid MOT with 3 comments.

Recorded mileage: 72,345

Recorded mileage: 72,345


FAIL


MOT TEST: 28 April 2008 16:50:33 FAILED
MOT TEST: 28 April 2008 16:50:33 FAILED

This test (422679518114) was completed on the 28 April 2008 16:50:33 and FAILED the requirements for a valid MOT with 5 comments.

This test (422679518114) was completed on the 28 April 2008 16:50:33 and FAILED the requirements for a valid MOT with 5 comments.

Recorded mileage: 72,334

Recorded mileage: 72,334


FAIL


MOT TEST: 03 August 2006 15:59:32 PASSED
MOT TEST: 03 August 2006 15:59:32 PASSED

This test (821985716294) was completed on the 03 August 2006 15:59:32 and PASSED the requirements for a valid MOT with 0 comments.

This test (821985716294) was completed on the 03 August 2006 15:59:32 and PASSED the requirements for a valid MOT with 0 comments.

Recorded mileage: 70,111

Recorded mileage: 70,111


MOT TEST: 02 August 2006 17:55:52 FAILED
MOT TEST: 02 August 2006 17:55:52 FAILED

This test (211924716245) was completed on the 02 August 2006 17:55:52 and FAILED the requirements for a valid MOT with 3 comments.

This test (211924716245) was completed on the 02 August 2006 17:55:52 and FAILED the requirements for a valid MOT with 3 comments.

Recorded mileage: 70,111

Recorded mileage: 70,111


FAIL


MOT TEST: 31 May 2006 15:16:36 FAILED
MOT TEST: 31 May 2006 15:16:36 FAILED

This test (593341456147) was completed on the 31 May 2006 15:16:36 and FAILED the requirements for a valid MOT with 2 comments.

This test (593341456147) was completed on the 31 May 2006 15:16:36 and FAILED the requirements for a valid MOT with 2 comments.

Recorded mileage: 70,090

Recorded mileage: 70,090


FAIL