JGG 314D


JGG314D is registered to a Black 1966, Morris 1 with a Diesel engine. It Failed its most recent MOT Test on the 10 November 2014

10 unique faults (11 Total) reported in its MOT History (7 Tests).

1 common/recurring faults.

71% (5) MOT Pass Rate and a 29% (2) MOT Failure Rate.

102,662 recorded miles.

JGG 314D


JGG314D is registered to a Black 1966, Morris 1 with a Diesel engine. It Failed its most recent MOT Test on the 10 November 2014

10 unique faults (11 Total) reported in its MOT History (7 Tests).

1 common/recurring faults.

71% (5) MOT Pass Rate and a 29% (2) MOT Failure Rate.

102,662 recorded miles.

MOT PASS/Failure rate for JGG 314D

all MOT test results for JGG 314D represented as a percentage
MOT PASS/Failure rate for JGG 314D
all MOT test results for JGG 314D represented as a percentage

PERCENTAGE OF VEHICLE FAULTS WITH JGG 314D

ALL REPORTED FAULTS, DISPLAYED BY PERCENTAGE OF OCCURRENCE DURING ALL MOT TESTS
PERCENTAGE OF VEHICLE FAULTS WITH JGG 314D
ALL REPORTED FAULTS, DISPLAYED BY PERCENTAGE OF OCCURRENCE DURING ALL MOT TESTS
ADVISORY

FAIL

JGG 314D annual Faults by type

ALL REPORTED FAULTS, DISPLAYED over time and categorised by type
JGG 314D annual Faults by type
ALL REPORTED FAULTS, DISPLAYED over time and categorised by type

ALL JGG 314D ADVISORIES [3]

ALL ADVISORIES, ORDERED by OCCURRENCE DURING JGG 314D's MOT HISTORY
ALL JGG 314D ADVISORIES [3]
ALL ADVISORIES, ORDERED by OCCURRENCE DURING JGG 314D's MOT HISTORY
Advisory Faults | source www.vehiclestats.co.uk
Fault Fault Test Date Test Date/Time Reference MOT Test Reference
2 Nearside front stub axle has slight vertical movement between stub axle and axle beam (2.5.a.1a) Nearside front stub axle has slight vertical movement between stub axle and axle beam (2.5.a.1a) 22 July 2013 [14:27] 22/07/2013 22 July 2013 [13:09] 22/07/2013 526453303201 526453303201 656003303291 656003303291
1 Centre rear exhaust has part of the system slightly deteriorated (7.1.1a) Centre rear exhaust has part of the system slightly deteriorated (7.1.1a) 28 April 2006 [17:33] 28/04/2006 423098916172 423098916172

ALL JGG 314D Failure Faults [8]

ALL Failure faults, ORDERED by OCCURRENCE DURING JGG 314D's MOT HISTORY
ALL JGG 314D Failure Faults [8]
ALL Failure faults, ORDERED by OCCURRENCE DURING JGG 314D's MOT HISTORY
Fail Faults | source www.vehiclestats.co.uk
Fault Fault Test Date Test Date/Time Reference MOT Test Reference
1 Nearside front tyre has a tear, caused by separation or partial failure of its structure (4.1.d.1b) Nearside front tyre has a tear, caused by separation or partial failure of its structure (4.1.d.1b) 22 July 2013 [13:09] 22/07/2013 656003303291 656003303291
1 Front passenger door cannot be opened from inside the vehicle (6.2.b.1b) Front passenger door cannot be opened from inside the vehicle (6.2.b.1b) 04 July 2012 [10:04] 04/07/2012 169766282159 169766282159
1 Front windscreen washer provides insufficient washer liquid (8.2.3) Front windscreen washer provides insufficient washer liquid (8.2.3) 04 July 2012 [10:04] 04/07/2012 169766282159 169766282159
1 Nearside side repeater not working (1.4.a.2c) Nearside side repeater not working (1.4.a.2c) 04 July 2012 [10:04] 04/07/2012 169766282159 169766282159
1 Offside front axle king pin has excessive play in pin and/or bush adversely affecting the steering (2.5.a.3a) Offside front axle king pin has excessive play in pin and/or bush adversely affecting the steering (2.5.a.3a) 04 July 2012 [10:04] 04/07/2012 169766282159 169766282159
1 Nearside front mechanical brake component has restricted free movement (3.5.1k) Nearside front mechanical brake component has restricted free movement (3.5.1k) 04 July 2012 [10:04] 04/07/2012 169766282159 169766282159
1 Parking brake lever inappropriately repaired (3.1.8) Parking brake lever inappropriately repaired (3.1.8) 04 July 2012 [10:04] 04/07/2012 169766282159 169766282159
1 Brakes imbalanced across an axle (3.7.b.5b) Brakes imbalanced across an axle (3.7.b.5b) 04 July 2012 [10:04] 04/07/2012 169766282159 169766282159

MOT TEST: 10 November 2014 12:18:05 PASSED
MOT TEST: 10 November 2014 12:18:05 PASSED

This test (539304714347) was completed on the 10 November 2014 12:18:05 and PASSED the requirements for a valid MOT with 0 comments.

This test (539304714347) was completed on the 10 November 2014 12:18:05 and PASSED the requirements for a valid MOT with 0 comments.

Recorded mileage: 102,662

Recorded mileage: 102,662


MOT TEST: 22 July 2013 14:27:42 PASSED
MOT TEST: 22 July 2013 14:27:42 PASSED

This test (526453303201) was completed on the 22 July 2013 14:27:42 and PASSED the requirements for a valid MOT with 1 comments.

This test (526453303201) was completed on the 22 July 2013 14:27:42 and PASSED the requirements for a valid MOT with 1 comments.

Recorded mileage: 102,660

Recorded mileage: 102,660


ADVISORY


MOT TEST: 22 July 2013 13:09:49 FAILED
MOT TEST: 22 July 2013 13:09:49 FAILED

This test (656003303291) was completed on the 22 July 2013 13:09:49 and FAILED the requirements for a valid MOT with 2 comments.

This test (656003303291) was completed on the 22 July 2013 13:09:49 and FAILED the requirements for a valid MOT with 2 comments.

Recorded mileage: 102,657

Recorded mileage: 102,657


ADVISORY

FAIL


MOT TEST: 09 July 2012 17:36:46 PASSED
MOT TEST: 09 July 2012 17:36:46 PASSED

This test (837381492131) was completed on the 09 July 2012 17:36:46 and PASSED the requirements for a valid MOT with 0 comments.

This test (837381492131) was completed on the 09 July 2012 17:36:46 and PASSED the requirements for a valid MOT with 0 comments.

Recorded mileage: 102,034

Recorded mileage: 102,034


MOT TEST: 04 July 2012 10:04:21 FAILED
MOT TEST: 04 July 2012 10:04:21 FAILED

This test (169766282159) was completed on the 04 July 2012 10:04:21 and FAILED the requirements for a valid MOT with 7 comments.

This test (169766282159) was completed on the 04 July 2012 10:04:21 and FAILED the requirements for a valid MOT with 7 comments.

Recorded mileage: 102,034

Recorded mileage: 102,034


FAIL


MOT TEST: 27 June 2006 13:19:31 PASSED
MOT TEST: 27 June 2006 13:19:31 PASSED

This test (513448476101) was completed on the 27 June 2006 13:19:31 and PASSED the requirements for a valid MOT with 0 comments.

This test (513448476101) was completed on the 27 June 2006 13:19:31 and PASSED the requirements for a valid MOT with 0 comments.

Recorded mileage: 102,069

Recorded mileage: 102,069


MOT TEST: 28 April 2006 17:33:01 PASSED
MOT TEST: 28 April 2006 17:33:01 PASSED

This test (423098916172) was completed on the 28 April 2006 17:33:01 and PASSED the requirements for a valid MOT with 1 comments.

This test (423098916172) was completed on the 28 April 2006 17:33:01 and PASSED the requirements for a valid MOT with 1 comments.

Recorded mileage: 102,033

Recorded mileage: 102,033


ADVISORY