JGH 593D


JGH593D is registered to a Grey 1966, Morris Minor 1000 with a Petrol engine. It Passed its most recent MOT Test on the 10 January 2019

21 unique faults (21 Total) reported in its MOT History (14 Tests).

0 common/recurring faults.

79% (11) MOT Pass Rate and a 21% (3) MOT Failure Rate.

67,310 recorded miles.

JGH 593D


JGH593D is registered to a Grey 1966, Morris Minor 1000 with a Petrol engine. It Passed its most recent MOT Test on the 10 January 2019

21 unique faults (21 Total) reported in its MOT History (14 Tests).

0 common/recurring faults.

79% (11) MOT Pass Rate and a 21% (3) MOT Failure Rate.

67,310 recorded miles.

MOT PASS/Failure rate for JGH 593D

all MOT test results for JGH 593D represented as a percentage
MOT PASS/Failure rate for JGH 593D
all MOT test results for JGH 593D represented as a percentage

PERCENTAGE OF VEHICLE FAULTS WITH JGH 593D

ALL REPORTED FAULTS, DISPLAYED BY PERCENTAGE OF OCCURRENCE DURING ALL MOT TESTS
PERCENTAGE OF VEHICLE FAULTS WITH JGH 593D
ALL REPORTED FAULTS, DISPLAYED BY PERCENTAGE OF OCCURRENCE DURING ALL MOT TESTS
ADVISORY

FAIL

USER ENTERED

JGH 593D annual Faults by type

ALL REPORTED FAULTS, DISPLAYED over time and categorised by type
JGH 593D annual Faults by type
ALL REPORTED FAULTS, DISPLAYED over time and categorised by type

ALL JGH 593D ADVISORIES [5]

ALL ADVISORIES, ORDERED by OCCURRENCE DURING JGH 593D's MOT HISTORY
ALL JGH 593D ADVISORIES [5]
ALL ADVISORIES, ORDERED by OCCURRENCE DURING JGH 593D's MOT HISTORY
Advisory Faults | source www.vehiclestats.co.uk
Fault Fault Test Date Test Date/Time Reference MOT Test Reference
1 Slight play in offside front lower ball joint. Slight play in offside front lower ball joint. 17 November 2017 [10:00] 17/11/2017 675332914101 675332914101
1 Slight play in offside front upper link arm bushes. Slight play in offside front upper link arm bushes. 17 November 2017 [10:00] 17/11/2017 675332914101 675332914101
1 Offside front tyre worn close to the legal limit (4.1.e.1) Offside front tyre worn close to the legal limit (4.1.e.1) 26 May 2006 [16:28] 26/05/2006 132676946121 132676946121
1 Offside rear tyre worn close to the legal limit (4.1.e.1) Offside rear tyre worn close to the legal limit (4.1.e.1) 26 May 2006 [16:28] 26/05/2006 132676946121 132676946121
1 Nearside front tyre worn close to the legal limit (4.1.e.1) Nearside front tyre worn close to the legal limit (4.1.e.1) 26 May 2006 [16:28] 26/05/2006 132676946121 132676946121

ALL JGH 593D Failure Faults [14]

ALL Failure faults, ORDERED by OCCURRENCE DURING JGH 593D's MOT HISTORY
ALL JGH 593D Failure Faults [14]
ALL Failure faults, ORDERED by OCCURRENCE DURING JGH 593D's MOT HISTORY
Fail Faults | source www.vehiclestats.co.uk
Fault Fault Test Date Test Date/Time Reference MOT Test Reference
1 Offside front direction indicator not working (1.4.a.2c) Offside front direction indicator not working (1.4.a.2c) 12 May 2011 [09:07] 12/05/2011 345662031107 345662031107
1 Offside rear direction indicator incorrect colour (1.4.a.2f) Offside rear direction indicator incorrect colour (1.4.a.2f) 12 May 2011 [09:07] 12/05/2011 345662031107 345662031107
1 Offside indicator tell tale inoperative (1.4.a.2a) Offside indicator tell tale inoperative (1.4.a.2a) 12 May 2011 [09:07] 12/05/2011 345662031107 345662031107
1 Offside headlamp aim too high (1.8) Offside headlamp aim too high (1.8) 25 May 2007 [16:19] 25/05/2007 223805447467 223805447467
1 Offside front seat belt locking mechanism does not secure or release (5.2.5a) Offside front seat belt locking mechanism does not secure or release (5.2.5a) 25 May 2007 [16:19] 25/05/2007 223805447467 223805447467
1 Parking brake lever has no reserve travel (3.1.6b) Parking brake lever has no reserve travel (3.1.6b) 25 May 2007 [16:19] 25/05/2007 223805447467 223805447467
1 Tyre tread depth below requirements of 1.6mm (4.1.e.1) Tyre tread depth below requirements of 1.6mm (4.1.e.1) 25 May 2007 [16:19] 25/05/2007 223805447467 223805447467
1 Registration plate lamp not working (1.1.5c) Registration plate lamp not working (1.1.5c) 25 May 2007 [16:19] 25/05/2007 223805447467 223805447467
1 Offside windscreen wiper blade deteriorated (8.2.2) Offside windscreen wiper blade deteriorated (8.2.2) 25 May 2007 [16:19] 25/05/2007 223805447467 223805447467
1 Suspension component mounting prescribed area is excessively corroded (2.4.a.3) Suspension component mounting prescribed area is excessively corroded (2.4.a.3) 25 May 2007 [16:19] 25/05/2007 223805447467 223805447467
1 Offside rear rear brake recording little or no effort (3.7.b.5a) Offside rear rear brake recording little or no effort (3.7.b.5a) 25 May 2007 [16:19] 25/05/2007 223805447467 223805447467
1 Parking brake: efficiency below requirements (3.7.b.7) Parking brake: efficiency below requirements (3.7.b.7) 25 May 2007 [16:19] 25/05/2007 223805447467 223805447467
1 Nearside front suspension has excessive play in a lower suspension ball joint (2.5.b.1a) Nearside front suspension has excessive play in a lower suspension ball joint (2.5.b.1a) 26 May 2006 [16:28] 26/05/2006 132676946121 132676946121
1 Nearside front suspension component mounting prescribed area is excessively corroded (2.4.a.3) Nearside front suspension component mounting prescribed area is excessively corroded (2.4.a.3) 26 May 2006 [16:28] 26/05/2006 132676946121 132676946121

ALL JGH 593D User Entered Faults [2]

ALL User Entered faults, ORDERED by OCCURRENCE DURING JGH 593D's MOT HISTORY
ALL JGH 593D User Entered Faults [2]
ALL User Entered faults, ORDERED by OCCURRENCE DURING JGH 593D's MOT HISTORY
Fail Faults | source www.vehiclestats.co.uk
Fault Fault Test Date Test Date/Time Reference MOT Test Reference
1 Fuel pipes corroded Fuel pipes corroded 26 May 2006 [16:28] 26/05/2006 132676946121 132676946121
1 Oil leak Oil leak 26 May 2006 [16:28] 26/05/2006 132676946121 132676946121

MOT TEST: 10 January 2019 10:33:15 PASSED
MOT TEST: 10 January 2019 10:33:15 PASSED

This test (918961895024) was completed on the 10 January 2019 10:33:15 and PASSED the requirements for a valid MOT with 0 comments.

This test (918961895024) was completed on the 10 January 2019 10:33:15 and PASSED the requirements for a valid MOT with 0 comments.

Recorded mileage: 67,310

Recorded mileage: 67,310


MOT TEST: 17 November 2017 10:00:40 PASSED
MOT TEST: 17 November 2017 10:00:40 PASSED

This test (675332914101) was completed on the 17 November 2017 10:00:40 and PASSED the requirements for a valid MOT with 2 comments.

This test (675332914101) was completed on the 17 November 2017 10:00:40 and PASSED the requirements for a valid MOT with 2 comments.

Recorded mileage: 66,901

Recorded mileage: 66,901


ADVISORY


MOT TEST: 12 November 2016 10:51:29 PASSED
MOT TEST: 12 November 2016 10:51:29 PASSED

This test (853555478796) was completed on the 12 November 2016 10:51:29 and PASSED the requirements for a valid MOT with 0 comments.

This test (853555478796) was completed on the 12 November 2016 10:51:29 and PASSED the requirements for a valid MOT with 0 comments.

Recorded mileage: 66,607

Recorded mileage: 66,607


MOT TEST: 17 November 2015 10:42:01 PASSED
MOT TEST: 17 November 2015 10:42:01 PASSED

This test (565974225186) was completed on the 17 November 2015 10:42:01 and PASSED the requirements for a valid MOT with 0 comments.

This test (565974225186) was completed on the 17 November 2015 10:42:01 and PASSED the requirements for a valid MOT with 0 comments.

Recorded mileage: 66,310

Recorded mileage: 66,310


MOT TEST: 18 October 2014 09:47:15 PASSED
MOT TEST: 18 October 2014 09:47:15 PASSED

This test (937911894249) was completed on the 18 October 2014 09:47:15 and PASSED the requirements for a valid MOT with 0 comments.

This test (937911894249) was completed on the 18 October 2014 09:47:15 and PASSED the requirements for a valid MOT with 0 comments.

Recorded mileage: 65,469

Recorded mileage: 65,469


MOT TEST: 29 October 2013 11:03:40 PASSED
MOT TEST: 29 October 2013 11:03:40 PASSED

This test (298242003301) was completed on the 29 October 2013 11:03:40 and PASSED the requirements for a valid MOT with 0 comments.

This test (298242003301) was completed on the 29 October 2013 11:03:40 and PASSED the requirements for a valid MOT with 0 comments.

Recorded mileage: 63,756

Recorded mileage: 63,756


MOT TEST: 28 August 2012 14:33:53 PASSED
MOT TEST: 28 August 2012 14:33:53 PASSED

This test (339201642437) was completed on the 28 August 2012 14:33:53 and PASSED the requirements for a valid MOT with 0 comments.

This test (339201642437) was completed on the 28 August 2012 14:33:53 and PASSED the requirements for a valid MOT with 0 comments.

Recorded mileage: 63,469

Recorded mileage: 63,469


MOT TEST: 12 May 2011 09:51:24 PASSED
MOT TEST: 12 May 2011 09:51:24 PASSED

This test (867842731178) was completed on the 12 May 2011 09:51:24 and PASSED the requirements for a valid MOT with 0 comments.

This test (867842731178) was completed on the 12 May 2011 09:51:24 and PASSED the requirements for a valid MOT with 0 comments.

Recorded mileage: 62,991

Recorded mileage: 62,991


MOT TEST: 12 May 2011 09:07:08 FAILED
MOT TEST: 12 May 2011 09:07:08 FAILED

This test (345662031107) was completed on the 12 May 2011 09:07:08 and FAILED the requirements for a valid MOT with 3 comments.

This test (345662031107) was completed on the 12 May 2011 09:07:08 and FAILED the requirements for a valid MOT with 3 comments.

Recorded mileage: 62,991

Recorded mileage: 62,991


FAIL


MOT TEST: 12 May 2010 16:18:53 PASSED
MOT TEST: 12 May 2010 16:18:53 PASSED

This test (833132530152) was completed on the 12 May 2010 16:18:53 and PASSED the requirements for a valid MOT with 0 comments.

This test (833132530152) was completed on the 12 May 2010 16:18:53 and PASSED the requirements for a valid MOT with 0 comments.

Recorded mileage: 62,206

Recorded mileage: 62,206


MOT TEST: 16 June 2007 10:59:06 PASSED
MOT TEST: 16 June 2007 10:59:06 PASSED

This test (300757067162) was completed on the 16 June 2007 10:59:06 and PASSED the requirements for a valid MOT with 0 comments.

This test (300757067162) was completed on the 16 June 2007 10:59:06 and PASSED the requirements for a valid MOT with 0 comments.

Recorded mileage: 59,812

Recorded mileage: 59,812


MOT TEST: 25 May 2007 16:19:00 FAILED
MOT TEST: 25 May 2007 16:19:00 FAILED

This test (223805447467) was completed on the 25 May 2007 16:19:00 and FAILED the requirements for a valid MOT with 9 comments.

This test (223805447467) was completed on the 25 May 2007 16:19:00 and FAILED the requirements for a valid MOT with 9 comments.

Recorded mileage: 59,711

Recorded mileage: 59,711


FAIL


MOT TEST: 14 June 2006 14:52:33 PASSED
MOT TEST: 14 June 2006 14:52:33 PASSED

This test (843725966147) was completed on the 14 June 2006 14:52:33 and PASSED the requirements for a valid MOT with 0 comments.

This test (843725966147) was completed on the 14 June 2006 14:52:33 and PASSED the requirements for a valid MOT with 0 comments.

Recorded mileage: 56,463

Recorded mileage: 56,463


MOT TEST: 26 May 2006 16:28:15 FAILED
MOT TEST: 26 May 2006 16:28:15 FAILED

This test (132676946121) was completed on the 26 May 2006 16:28:15 and FAILED the requirements for a valid MOT with 7 comments.

This test (132676946121) was completed on the 26 May 2006 16:28:15 and FAILED the requirements for a valid MOT with 7 comments.

Recorded mileage: 56,463

Recorded mileage: 56,463


ADVISORY

FAIL

USER ENTERED