JHH 267E


JHH267E is registered to a Green 1967, Morris Minor with a Petrol engine. It Failed its most recent MOT Test on the 11 September 2017

9 unique faults (9 Total) reported in its MOT History (13 Tests).

0 common/recurring faults.

85% (11) MOT Pass Rate and a 15% (2) MOT Failure Rate.

33,315 recorded miles.

JHH 267E


JHH267E is registered to a Green 1967, Morris Minor with a Petrol engine. It Failed its most recent MOT Test on the 11 September 2017

9 unique faults (9 Total) reported in its MOT History (13 Tests).

0 common/recurring faults.

85% (11) MOT Pass Rate and a 15% (2) MOT Failure Rate.

33,315 recorded miles.

MOT PASS/Failure rate for JHH 267E

all MOT test results for JHH 267E represented as a percentage
MOT PASS/Failure rate for JHH 267E
all MOT test results for JHH 267E represented as a percentage

PERCENTAGE OF VEHICLE FAULTS WITH JHH 267E

ALL REPORTED FAULTS, DISPLAYED BY PERCENTAGE OF OCCURRENCE DURING ALL MOT TESTS
PERCENTAGE OF VEHICLE FAULTS WITH JHH 267E
ALL REPORTED FAULTS, DISPLAYED BY PERCENTAGE OF OCCURRENCE DURING ALL MOT TESTS
ADVISORY

FAIL

USER ENTERED

JHH 267E annual Faults by type

ALL REPORTED FAULTS, DISPLAYED over time and categorised by type
JHH 267E annual Faults by type
ALL REPORTED FAULTS, DISPLAYED over time and categorised by type

ALL JHH 267E ADVISORIES [2]

ALL ADVISORIES, ORDERED by OCCURRENCE DURING JHH 267E's MOT HISTORY
ALL JHH 267E ADVISORIES [2]
ALL ADVISORIES, ORDERED by OCCURRENCE DURING JHH 267E's MOT HISTORY
Advisory Faults | source www.vehiclestats.co.uk
Fault Fault Test Date Test Date/Time Reference MOT Test Reference
1 Vehicle structure has slight corrosion (6.1.b.2) Vehicle structure has slight corrosion (6.1.b.2) 10 July 2007 [14:37] 10/07/2007 473601997183 473601997183
1 Steering system has slight free play detected at steering wheel (2.2.a.1b) Steering system has slight free play detected at steering wheel (2.2.a.1b) 10 July 2007 [14:37] 10/07/2007 473601997183 473601997183

ALL JHH 267E Failure Faults [4]

ALL Failure faults, ORDERED by OCCURRENCE DURING JHH 267E's MOT HISTORY
ALL JHH 267E Failure Faults [4]
ALL Failure faults, ORDERED by OCCURRENCE DURING JHH 267E's MOT HISTORY
Fail Faults | source www.vehiclestats.co.uk
Fault Fault Test Date Test Date/Time Reference MOT Test Reference
1 Offside rear suspension component mounting prescribed area is excessively corroded (2.4.a.3) Offside rear suspension component mounting prescribed area is excessively corroded (2.4.a.3) 06 July 2010 [10:08] 06/07/2010 344167380101 344167380101
1 Rear sub-frame corroded and seriously weakened (2.4.g.1) Rear sub-frame corroded and seriously weakened (2.4.g.1) 06 July 2010 [10:08] 06/07/2010 344167380101 344167380101
1 Nearside steering arm has relative movement at its fixings (2.2.b.1h) Nearside steering arm has relative movement at its fixings (2.2.b.1h) 30 June 2008 [11:39] 30/06/2008 273122788402 273122788402
1 Parking brake: efficiency below requirements (3.7.b.7) Parking brake: efficiency below requirements (3.7.b.7) 30 June 2008 [11:39] 30/06/2008 273122788402 273122788402

ALL JHH 267E User Entered Faults [3]

ALL User Entered faults, ORDERED by OCCURRENCE DURING JHH 267E's MOT HISTORY
ALL JHH 267E User Entered Faults [3]
ALL User Entered faults, ORDERED by OCCURRENCE DURING JHH 267E's MOT HISTORY
Fail Faults | source www.vehiclestats.co.uk
Fault Fault Test Date Test Date/Time Reference MOT Test Reference
1 Rear subframe corroded Rear subframe corroded 30 June 2008 [11:39] 30/06/2008 273122788402 273122788402
1 Battery tray corroded Battery tray corroded 30 June 2008 [11:39] 30/06/2008 273122788402 273122788402
1 Underside of vehicle undersealed Underside of vehicle undersealed 30 June 2008 [11:39] 30/06/2008 273122788402 273122788402

MOT TEST: 11 September 2017 10:51:47 PASSED
MOT TEST: 11 September 2017 10:51:47 PASSED

This test (705874900536) was completed on the 11 September 2017 10:51:47 and PASSED the requirements for a valid MOT with 0 comments.

This test (705874900536) was completed on the 11 September 2017 10:51:47 and PASSED the requirements for a valid MOT with 0 comments.

Recorded mileage: 33,315

Recorded mileage: 33,315


MOT TEST: 01 September 2016 12:25:43 PASSED
MOT TEST: 01 September 2016 12:25:43 PASSED

This test (408840043621) was completed on the 01 September 2016 12:25:43 and PASSED the requirements for a valid MOT with 0 comments.

This test (408840043621) was completed on the 01 September 2016 12:25:43 and PASSED the requirements for a valid MOT with 0 comments.

Recorded mileage: 33,306

Recorded mileage: 33,306


MOT TEST: 30 July 2015 11:17:06 PASSED
MOT TEST: 30 July 2015 11:17:06 PASSED

This test (276861715236) was completed on the 30 July 2015 11:17:06 and PASSED the requirements for a valid MOT with 0 comments.

This test (276861715236) was completed on the 30 July 2015 11:17:06 and PASSED the requirements for a valid MOT with 0 comments.

Recorded mileage: 33,298

Recorded mileage: 33,298


MOT TEST: 30 July 2014 11:04:16 PASSED
MOT TEST: 30 July 2014 11:04:16 PASSED

This test (465871114281) was completed on the 30 July 2014 11:04:16 and PASSED the requirements for a valid MOT with 0 comments.

This test (465871114281) was completed on the 30 July 2014 11:04:16 and PASSED the requirements for a valid MOT with 0 comments.

Recorded mileage: 33,268

Recorded mileage: 33,268


MOT TEST: 12 August 2013 13:56:04 PASSED
MOT TEST: 12 August 2013 13:56:04 PASSED

This test (246944423257) was completed on the 12 August 2013 13:56:04 and PASSED the requirements for a valid MOT with 0 comments.

This test (246944423257) was completed on the 12 August 2013 13:56:04 and PASSED the requirements for a valid MOT with 0 comments.

Recorded mileage: 33,227

Recorded mileage: 33,227


MOT TEST: 01 August 2012 09:16:04 PASSED
MOT TEST: 01 August 2012 09:16:04 PASSED

This test (917974412240) was completed on the 01 August 2012 09:16:04 and PASSED the requirements for a valid MOT with 0 comments.

This test (917974412240) was completed on the 01 August 2012 09:16:04 and PASSED the requirements for a valid MOT with 0 comments.

Recorded mileage: 950

Recorded mileage: 950


MOT TEST: 08 August 2011 11:24:40 PASSED
MOT TEST: 08 August 2011 11:24:40 PASSED

This test (775760921235) was completed on the 08 August 2011 11:24:40 and PASSED the requirements for a valid MOT with 0 comments.

This test (775760921235) was completed on the 08 August 2011 11:24:40 and PASSED the requirements for a valid MOT with 0 comments.

Recorded mileage: 33,060

Recorded mileage: 33,060


MOT TEST: 13 August 2010 11:52:26 PASSED
MOT TEST: 13 August 2010 11:52:26 PASSED

This test (164305220241) was completed on the 13 August 2010 11:52:26 and PASSED the requirements for a valid MOT with 0 comments.

This test (164305220241) was completed on the 13 August 2010 11:52:26 and PASSED the requirements for a valid MOT with 0 comments.

Recorded mileage: 33,007

Recorded mileage: 33,007


MOT TEST: 06 July 2010 10:08:04 FAILED
MOT TEST: 06 July 2010 10:08:04 FAILED

This test (344167380101) was completed on the 06 July 2010 10:08:04 and FAILED the requirements for a valid MOT with 2 comments.

This test (344167380101) was completed on the 06 July 2010 10:08:04 and FAILED the requirements for a valid MOT with 2 comments.

Recorded mileage: 33,000

Recorded mileage: 33,000


FAIL


MOT TEST: 23 June 2009 11:08:18 PASSED
MOT TEST: 23 June 2009 11:08:18 PASSED

This test (920814179122) was completed on the 23 June 2009 11:08:18 and PASSED the requirements for a valid MOT with 0 comments.

This test (920814179122) was completed on the 23 June 2009 11:08:18 and PASSED the requirements for a valid MOT with 0 comments.

Recorded mileage: 32,952

Recorded mileage: 32,952


MOT TEST: 07 July 2008 09:12:32 PASSED
MOT TEST: 07 July 2008 09:12:32 PASSED

This test (401099788174) was completed on the 07 July 2008 09:12:32 and PASSED the requirements for a valid MOT with 0 comments.

This test (401099788174) was completed on the 07 July 2008 09:12:32 and PASSED the requirements for a valid MOT with 0 comments.

Recorded mileage: 32,809

Recorded mileage: 32,809


MOT TEST: 30 June 2008 11:39:51 FAILED
MOT TEST: 30 June 2008 11:39:51 FAILED

This test (273122788402) was completed on the 30 June 2008 11:39:51 and FAILED the requirements for a valid MOT with 5 comments.

This test (273122788402) was completed on the 30 June 2008 11:39:51 and FAILED the requirements for a valid MOT with 5 comments.

Recorded mileage: 32,805

Recorded mileage: 32,805


FAIL

USER ENTERED


MOT TEST: 10 July 2007 14:37:17 PASSED
MOT TEST: 10 July 2007 14:37:17 PASSED

This test (473601997183) was completed on the 10 July 2007 14:37:17 and PASSED the requirements for a valid MOT with 2 comments.

This test (473601997183) was completed on the 10 July 2007 14:37:17 and PASSED the requirements for a valid MOT with 2 comments.

Recorded mileage: 32,591

Recorded mileage: 32,591


ADVISORY