JHJ 627D


JHJ627D is registered to a White 1966, Morris Minor 1000 with a Petrol engine. It Failed its most recent MOT Test on the 31 August 2010

28 unique faults (30 Total) reported in its MOT History (7 Tests).

1 common/recurring faults.

43% (3) MOT Pass Rate and a 57% (4) MOT Failure Rate.

11,095 recorded miles.

JHJ 627D


JHJ627D is registered to a White 1966, Morris Minor 1000 with a Petrol engine. It Failed its most recent MOT Test on the 31 August 2010

28 unique faults (30 Total) reported in its MOT History (7 Tests).

1 common/recurring faults.

43% (3) MOT Pass Rate and a 57% (4) MOT Failure Rate.

11,095 recorded miles.

MOT PASS/Failure rate for JHJ 627D

all MOT test results for JHJ 627D represented as a percentage
MOT PASS/Failure rate for JHJ 627D
all MOT test results for JHJ 627D represented as a percentage

PERCENTAGE OF VEHICLE FAULTS WITH JHJ 627D

ALL REPORTED FAULTS, DISPLAYED BY PERCENTAGE OF OCCURRENCE DURING ALL MOT TESTS
PERCENTAGE OF VEHICLE FAULTS WITH JHJ 627D
ALL REPORTED FAULTS, DISPLAYED BY PERCENTAGE OF OCCURRENCE DURING ALL MOT TESTS
FAIL

USER ENTERED

PASS WITH RECTIFICATION

JHJ 627D annual Faults by type

ALL REPORTED FAULTS, DISPLAYED over time and categorised by type
JHJ 627D annual Faults by type
ALL REPORTED FAULTS, DISPLAYED over time and categorised by type

ALL JHJ 627D Failure Faults [16]

ALL Failure faults, ORDERED by OCCURRENCE DURING JHJ 627D's MOT HISTORY
ALL JHJ 627D Failure Faults [16]
ALL Failure faults, ORDERED by OCCURRENCE DURING JHJ 627D's MOT HISTORY
Fail Faults | source www.vehiclestats.co.uk
Fault Fault Test Date Test Date/Time Reference MOT Test Reference
1 All position lamps not working (1.1.a.3b) All position lamps not working (1.1.a.3b) 04 June 2010 [13:01] 04/06/2010 901415850153 901415850153
1 Registration plate lamp not working (1.1.5c) Registration plate lamp not working (1.1.5c) 04 June 2010 [13:01] 04/06/2010 901415850153 901415850153
1 Nearside headlamp aim too low (1.8) Nearside headlamp aim too low (1.8) 04 June 2010 [13:01] 04/06/2010 901415850153 901415850153
1 Nearside inner seat belt anchorage prescribed area is excessively corroded (5.2.6) Nearside inner seat belt anchorage prescribed area is excessively corroded (5.2.6) 04 June 2010 [13:01] 04/06/2010 901415850153 901415850153
1 Nearside inner rear suspension spring mounting prescribed area is excessively corroded (2.4.a.3) Nearside inner rear suspension spring mounting prescribed area is excessively corroded (2.4.a.3) 04 June 2010 [13:01] 04/06/2010 901415850153 901415850153
1 Nearside rear suspension spring mounting prescribed area is excessively corroded (2.4.a.3) Nearside rear suspension spring mounting prescribed area is excessively corroded (2.4.a.3) 04 June 2010 [13:01] 04/06/2010 901415850153 901415850153
1 Offside rear suspension spring mounting prescribed area is excessively corroded (2.4.a.3) Offside rear suspension spring mounting prescribed area is excessively corroded (2.4.a.3) 04 June 2010 [13:01] 04/06/2010 901415850153 901415850153
1 Nearside inner front suspension component mounting prescribed area is excessively corroded (2.4.a.3) Nearside inner front suspension component mounting prescribed area is excessively corroded (2.4.a.3) 04 June 2010 [13:01] 04/06/2010 901415850153 901415850153
1 Nearside front position lamp(s) not working (1.1.a.3b) Nearside front position lamp(s) not working (1.1.a.3b) 12 December 2007 [14:15] 12/12/2007 720646747388 720646747388
1 Nearside rear upper suspension component mounting prescribed area is excessively corroded (2.4.a.3) Nearside rear upper suspension component mounting prescribed area is excessively corroded (2.4.a.3) 12 December 2007 [14:15] 12/12/2007 720646747388 720646747388
1 Offside rear upper suspension component mounting prescribed area is excessively corroded (2.4.a.3) Offside rear upper suspension component mounting prescribed area is excessively corroded (2.4.a.3) 12 December 2007 [14:15] 12/12/2007 720646747388 720646747388
1 Nearside front suspension arm has excessive play in a ball joint (2.4.g.2) Nearside front suspension arm has excessive play in a ball joint (2.4.g.2) 12 December 2007 [14:15] 12/12/2007 720646747388 720646747388
1 Offside front suspension arm has excessive play in a ball joint (2.4.g.2) Offside front suspension arm has excessive play in a ball joint (2.4.g.2) 12 December 2007 [14:15] 12/12/2007 720646747388 720646747388
1 Indicator tell tale inoperative (1.4.a.2a) Indicator tell tale inoperative (1.4.a.2a) 23 November 2005 [11:15] 23/11/2005 151647225342 151647225342
1 Offside torsion bar attachment bracket corroded and seriously weakened (2.4.e.4c) Offside torsion bar attachment bracket corroded and seriously weakened (2.4.e.4c) 23 November 2005 [11:15] 23/11/2005 151647225342 151647225342

ALL JHJ 627D User Entered Faults [12]

ALL User Entered faults, ORDERED by OCCURRENCE DURING JHJ 627D's MOT HISTORY
ALL JHJ 627D User Entered Faults [12]
ALL User Entered faults, ORDERED by OCCURRENCE DURING JHJ 627D's MOT HISTORY
User Entered Faults | source www.vehiclestats.co.uk
Fault Fault Test Date Test Date/Time Reference MOT Test Reference
1 O/s mirror security O/s mirror security 31 August 2010 [15:40] 31/08/2010 982693640238 982693640238
1 O/s & n/s inner wings corroding O/s & n/s inner wings corroding 31 August 2010 [15:40] 31/08/2010 982693640238 982693640238
1 O/s & n/s floors corroding O/s & n/s floors corroding 31 August 2010 [15:40] 31/08/2010 982693640238 982693640238
1 O/s & n/s floor to sills corroding O/s & n/s floor to sills corroding 31 August 2010 [15:40] 31/08/2010 982693640238 982693640238
1 Slight lift to o/s/f & n/s/f upper & lower trunion joints Slight lift to o/s/f & n/s/f upper & lower trunion joints 31 August 2010 [15:40] 31/08/2010 982693640238 982693640238
1 Slight noise from o/s/f & n/s/f wheel bearings Slight noise from o/s/f & n/s/f wheel bearings 31 August 2010 [15:40] 31/08/2010 982693640238 982693640238
1 All four tyres perishing All four tyres perishing 31 August 2010 [15:40] 31/08/2010 982693640238 982693640238
1 O/s & n/s chassis corroding O/s & n/s chassis corroding 31 August 2010 [15:40] 31/08/2010 982693640238 982693640238
1 Front brake balance Front brake balance 31 August 2010 [15:40] 31/08/2010 982693640238 982693640238
1 Slight play to o/s & n/s track rod ends Slight play to o/s & n/s track rod ends 31 August 2010 [15:40] 31/08/2010 982693640238 982693640238
1 Offside mirror security Offside mirror security 04 June 2010 [13:01] 04/06/2010 901415850153 901415850153
1 Inner wings corroding Inner wings corroding 04 June 2010 [13:01] 04/06/2010 901415850153 901415850153

ALL JHJ 627D Pass With Rectification Faults [2]

ALL Pass With Rectification faults, ORDERED by OCCURRENCE DURING JHJ 627D's MOT HISTORY
ALL JHJ 627D Pass With Rectification Faults [2]
ALL Pass With Rectification faults, ORDERED by OCCURRENCE DURING JHJ 627D's MOT HISTORY
Pass With Rectification Faults | source www.vehiclestats.co.uk
Fault Fault Test Date Test Date/Time Reference MOT Test Reference
1 Nearside front position lamp(s) not working (1.1.a.3b) Nearside front position lamp(s) not working (1.1.a.3b) 29 November 2006 [11:15] 29/11/2006 614203936392 614203936392
1 Offside front suspension arm has excessive play in a pin/bearing (2.4.g.2) Offside front suspension arm has excessive play in a pin/bearing (2.4.g.2) 29 November 2006 [11:15] 29/11/2006 614203936392 614203936392

MOT TEST: 31 August 2010 15:40:03 PASSED
MOT TEST: 31 August 2010 15:40:03 PASSED

This test (982693640238) was completed on the 31 August 2010 15:40:03 and PASSED the requirements for a valid MOT with 10 comments.

This test (982693640238) was completed on the 31 August 2010 15:40:03 and PASSED the requirements for a valid MOT with 10 comments.

Recorded mileage: 11,095

Recorded mileage: 11,095


USER ENTERED


MOT TEST: 04 June 2010 13:01:52 FAILED
MOT TEST: 04 June 2010 13:01:52 FAILED

This test (901415850153) was completed on the 04 June 2010 13:01:52 and FAILED the requirements for a valid MOT with 11 comments.

This test (901415850153) was completed on the 04 June 2010 13:01:52 and FAILED the requirements for a valid MOT with 11 comments.

Recorded mileage: 11,080

Recorded mileage: 11,080


FAIL

USER ENTERED


MOT TEST: 12 December 2007 14:15:30 FAILED
MOT TEST: 12 December 2007 14:15:30 FAILED

This test (720646747388) was completed on the 12 December 2007 14:15:30 and FAILED the requirements for a valid MOT with 5 comments.

This test (720646747388) was completed on the 12 December 2007 14:15:30 and FAILED the requirements for a valid MOT with 5 comments.

Recorded mileage: 11,076

Recorded mileage: 11,076


FAIL


MOT TEST: 29 November 2006 11:15:58 PASSED
MOT TEST: 29 November 2006 11:15:58 PASSED

This test (683113236357) was completed on the 29 November 2006 11:15:58 and PASSED the requirements for a valid MOT with 0 comments.

This test (683113236357) was completed on the 29 November 2006 11:15:58 and PASSED the requirements for a valid MOT with 0 comments.

Recorded mileage: 10,661

Recorded mileage: 10,661


MOT TEST: 29 November 2006 11:15:58 FAILED
MOT TEST: 29 November 2006 11:15:58 FAILED

This test (614203936392) was completed on the 29 November 2006 11:15:58 and FAILED the requirements for a valid MOT with 2 comments.

This test (614203936392) was completed on the 29 November 2006 11:15:58 and FAILED the requirements for a valid MOT with 2 comments.

Recorded mileage: 10,661

Recorded mileage: 10,661


PASS WITH RECTIFICATION


MOT TEST: 06 December 2005 16:25:56 PASSED
MOT TEST: 06 December 2005 16:25:56 PASSED

This test (133450245333) was completed on the 06 December 2005 16:25:56 and PASSED the requirements for a valid MOT with 0 comments.

This test (133450245333) was completed on the 06 December 2005 16:25:56 and PASSED the requirements for a valid MOT with 0 comments.

Recorded mileage: 10,097

Recorded mileage: 10,097


MOT TEST: 23 November 2005 11:15:08 FAILED
MOT TEST: 23 November 2005 11:15:08 FAILED

This test (151647225342) was completed on the 23 November 2005 11:15:08 and FAILED the requirements for a valid MOT with 2 comments.

This test (151647225342) was completed on the 23 November 2005 11:15:08 and FAILED the requirements for a valid MOT with 2 comments.

Recorded mileage: 10,097

Recorded mileage: 10,097


FAIL